{"text_format":"1","workbook":"xlsx","n_sheets":10,"sheets":["Introduction","Summary","Risk Analysis","Charts","Seed, Fertilizer & Chemical","Op. Cost Input","Fixed Cost Input","Assumptions","Chart data (HIDE)","Data (HIDE)"],"not_rendered":{"charts":3,"images":2,"macros":1,"external_links":0,"defined_names":113,"comments":2,"pivot_tables":0},"unopened":[],"bounds":{"document_bytes":16777216,"sheet_cells":100000,"rows_first":2000,"rows_last":500,"rows_between":2000,"halvings":0,"cell_chars":16384,"cell_head_chars":4096},"cells_cut":0,"cells_raw":0,"read":"whole","date_system":"1900"}

{"sheet":"Introduction","index":0,"n_rows":46,"n_cols":9,"rows_kept":46,"cut":false,"hidden":false,"merged":[[5,0,5,8],[4,0,4,8],[48,1,48,8],[6,0,6,8],[16,1,22,8],[24,1,26,8],[45,1,47,8],[40,1,43,8]]}
[]
[]
[". . . . . . . . . . . . . . . . . . . . . . . . . . . . . . . . . . . . . . . . . . . . . . . . . "]
[]
["Guidelines For Estimating"]
[{"$f":"\"Special Crop Production Costs - \"&I11","v":"Special Crop Production Costs - 2022"}]
[]
[]
[]
[]
[null,null,null,null,null,null,null,"Date:  January,",2022]
[]
[]
[]
[]
{"$rows_left_out":32}
{"sheet":"Summary","index":1,"n_rows":69,"n_cols":23,"rows_kept":69,"cut":false,"hidden":false,"merged":[[68,1,69,8],[68,9,69,10],[0,0,0,8],[0,9,0,10],[32,2,32,8],[52,2,52,8]]}
[{"$f":"IF('Data (HIDE)'!B13=\"Manitoba\",\"Special Crop Production Costs \"&Introduction!I11&\" Guidelines (Dollars Per Acre)\",\"Special Crop Production Costs \"&Introduction!I11&\" Guidelines \"&'Data (HIDE)'!B13&\" (Dollars Per Acre)\")","v":"Special Crop Production Costs 2022 Guidelines (Dollars Per Acre)"}]
[null,null,{"$f":"'Data (HIDE)'!$B$16","v":"Black Bean"},{"$f":"'Data (HIDE)'!$B$17","v":"Hempseed"},{"$f":"'Data (HIDE)'!$B$18","v":"Kidney Bean"},{"$f":"'Data (HIDE)'!$B$19","v":"Fababean"},{"$f":"'Data (HIDE)'!$B$20","v":"Buckwheat"},{"$f":"'Data (HIDE)'!$B$21","v":"Canaryseed"},{"$f":"'Data (HIDE)'!$B$22","v":"Lentil"},null,"Your Farm"]
["A.  Operating Costs"]
[null,"Seed & Treatment",{"$f":"'Data (HIDE)'!$L$16","v":96.25},{"$f":"'Data (HIDE)'!$L$17","v":58.75},{"$f":"'Data (HIDE)'!$L$18","v":229.9},{"$f":"'Data (HIDE)'!$L$19","v":39.6},{"$f":"'Data (HIDE)'!$L$20","v":25},{"$f":"'Data (HIDE)'!$L$21","v":33},{"$f":"'Data (HIDE)'!$L$22","v":70}]
[null,"Fertilizer",{"$f":"'Data (HIDE)'!$M$16","v":103.13153114130613},{"$f":"'Data (HIDE)'!$M$17","v":103.13153114130613},{"$f":"'Data (HIDE)'!$M$18","v":103.13153114130613},{"$f":"'Data (HIDE)'!$M$19","v":49.815711670469909},{"$f":"'Data (HIDE)'!$M$20","v":55.553702620488359},{"$f":"'Data (HIDE)'!$M$21","v":89.243105486184035},{"$f":"'Data (HIDE)'!$M$22","v":25.62387036894884}]
[null,"Pesticide",{"$f":"'Data (HIDE)'!$N$16+'Data (HIDE)'!$O$16+'Data (HIDE)'!$P$16","v":117.52},{"$f":"'Data (HIDE)'!$N$17++'Data (HIDE)'!$O$17+'Data (HIDE)'!$P$17","v":47.54},{"$f":"'Data (HIDE)'!$N$18+'Data (HIDE)'!$O$18+'Data (HIDE)'!$P$18","v":117.52},{"$f":"'Data (HIDE)'!$N$19+'Data (HIDE)'!$O$19+'Data (HIDE)'!$P$19","v":15.5},{"$f":"'Data (HIDE)'!$N$20+'Data (HIDE)'!$O$20+'Data (HIDE)'!$P$20","v":6.13},{"$f":"'Data (HIDE)'!$N$21+'Data (HIDE)'!$O$21+'Data (HIDE)'!$P$21","v":28.17},{"$f":"'Data (HIDE)'!$N$22+'Data (HIDE)'!$O$22+'Data (HIDE)'!$P$22","v":29.380000000000003}]
[null,"if delete it will affect crop rotation and fuel calcs"]
[null,"if delete it will affect crop rotation and fuel calcs"]
[null,"Fuel",{"$f":"'Data (HIDE)'!$Q$16","v":23.880764421052632},{"$f":"'Data (HIDE)'!$Q$17","v":24.453561483253587},{"$f":"'Data (HIDE)'!$Q$18","v":23.319453052631577},{"$f":"'Data (HIDE)'!$Q$19","v":22.128387157894736},{"$f":"'Data (HIDE)'!$Q$20","v":21.003934105263156},{"$f":"'Data (HIDE)'!$Q$21","v":23.375130484210526},{"$f":"'Data (HIDE)'!$Q$22","v":19.929917631578945}]
[null,"Machinery Operating & Lease",{"$f":"'Data (HIDE)'!$R$16+'Data (HIDE)'!$S$16+'Data (HIDE)'!$T$16","v":22.88},{"$f":"'Data (HIDE)'!$R$17+'Data (HIDE)'!$S$17+'Data (HIDE)'!$T$17","v":22.88},{"$f":"'Data (HIDE)'!$R$18+'Data (HIDE)'!$S$18+'Data (HIDE)'!$T$18","v":22.88},{"$f":"'Data (HIDE)'!$R$19+'Data (HIDE)'!$S$19+'Data (HIDE)'!$T$19","v":22.88},{"$f":"'Data (HIDE)'!$R$20+'Data (HIDE)'!$S$20+'Data (HIDE)'!$T$20","v":22.88},{"$f":"'Data (HIDE)'!$R$21+'Data (HIDE)'!$S$21+'Data (HIDE)'!$T$21","v":22.88},{"$f":"'Data (HIDE)'!$R$22+'Data (HIDE)'!$S$22+'Data (HIDE)'!$T$22","v":22.88}]
[null,"if delete it will affect crop rotation and fuel calcs"]
[null,"if delete it will affect crop rotation and fuel calcs"]
[null,"Labour - Hired",{"$f":"'Data (HIDE)'!$U$16","v":5},{"$f":"'Data (HIDE)'!$U$17","v":5},{"$f":"'Data (HIDE)'!$U$18","v":5},{"$f":"'Data (HIDE)'!$U$19","v":5},{"$f":"'Data (HIDE)'!$U$20","v":5},{"$f":"'Data (HIDE)'!$U$21","v":5},{"$f":"'Data (HIDE)'!$U$22","v":5}]
[null,"Crop Insurance",{"$f":"'Data (HIDE)'!$V$16","v":33.5},{"$f":"'Data (HIDE)'!$V$17","v":36.75},{"$f":"'Data (HIDE)'!$V$18","v":48.25},{"$f":"'Data (HIDE)'!$V$19","v":36.75},{"$f":"'Data (HIDE)'!$V$20","v":19},{"$f":"'Data (HIDE)'!$V$21","v":24},{"$f":"'Data (HIDE)'!$V$22","v":17.25}]
[null,"Hail Insurance",{"$f":"'Data (HIDE)'!$W$16","v":16.537499999999998},{"$f":"'Data (HIDE)'!$W$17","v":18.899999999999999},{"$f":"'Data (HIDE)'!$W$18","v":16.537499999999998},{"$f":"'Data (HIDE)'!$W$19","v":16.537499999999998},{"$f":"'Data (HIDE)'!$W$20","v":23.625},{"$f":"'Data (HIDE)'!$W$21","v":9.4499999999999993},{"$f":"'Data (HIDE)'!$W$22","v":12.285}]
{"$rows_left_out":55}
{"sheet":"Risk Analysis","index":2,"n_rows":64,"n_cols":11,"rows_kept":64,"cut":false,"hidden":false,"merged":[[20,0,20,8],[20,9,20,10],[63,1,64,8],[0,0,0,8],[51,0,51,8]]}
[{"$f":"IF('Data (HIDE)'!B13=\"Manitoba\",\"AgriInsurance Analysis\",\"AgriInsurance Analysis - \"&'Data (HIDE)'!B13)","v":"AgriInsurance Analysis"}]
[]
[null,{"$f":"\"*Based on \"&'Data (HIDE)'!B45&\"*\"","v":"*Based on 2021 MASC data*"},{"$f":"'Data (HIDE)'!$B$16","v":"Black Bean"},{"$f":"'Data (HIDE)'!$B$17","v":"Hempseed"},{"$f":"'Data (HIDE)'!$B$18","v":"Kidney Bean"},{"$f":"'Data (HIDE)'!$B$19","v":"Fababean"},{"$f":"'Data (HIDE)'!$B$20","v":"Buckwheat"},{"$f":"'Data (HIDE)'!$B$21","v":"Canaryseed"},{"$f":"'Data (HIDE)'!$B$22","v":"Lentil"},null,"Your Farm"]
[]
["AgriInsurance "]
[null,{"$f":"'Data (HIDE)'!B14","v":"80% Insured Value"},{"$f":"'Data (HIDE)'!$AJ$16","v":520},{"$f":"'Data (HIDE)'!$AJ$17","v":460},{"$f":"'Data (HIDE)'!$AJ$18","v":610},{"$f":"'Data (HIDE)'!$AJ$19","v":200},{"$f":"'Data (HIDE)'!$AJ$20","v":180},{"$f":"'Data (HIDE)'!$AJ$21","v":420},{"$f":"'Data (HIDE)'!$AJ$22","v":250}]
[null,"Premium Cost (% of Insured)",{"$f":"'Data (HIDE)'!$AK$16","v":6.4423076923076916E-2},{"$f":"'Data (HIDE)'!$AK$17","v":7.9891304347826084E-2},{"$f":"'Data (HIDE)'!$AK$18","v":7.9098360655737707E-2},{"$f":"'Data (HIDE)'!$AK$19","v":0.18375},{"$f":"'Data (HIDE)'!$AK$20","v":0.10555555555555556},{"$f":"'Data (HIDE)'!$AK$21","v":5.7142857142857141E-2},{"$f":"'Data (HIDE)'!$AK$22","v":6.9000000000000006E-2}]
[]
["Costs Not Covered By AgriInsurance"]
[null,"Operating Costs",{"$f":"IF(Summary!C21-C6<0,0,SUM(Summary!C21-C6))","v":0},{"$f":"IF(Summary!D21-D6<0,0,SUM(Summary!D21-D6))","v":0},{"$f":"IF(Summary!E21-E6<0,0,SUM(Summary!E21-E6))","v":10.736326503082637},{"$f":"IF(Summary!F21-F6<0,0,SUM(Summary!F21-F6))","v":55.957339764817078},{"$f":"IF(Summary!G21-G6<0,0,SUM(Summary!G21-G6))","v":41.290535353058999},{"$f":"IF(Summary!H21-H6<0,0,SUM(Summary!H21-H6))","v":0},{"$f":"IF(Summary!I21-I6<0,0,SUM(Summary!I21-I6))","v":0}]
[null,"Operating & Fixed Costs",{"$f":"IF(Summary!C27-C6<0,0,SUM(Summary!C27-C6))","v":0},{"$f":"IF(Summary!D27-D6<0,0,SUM(Summary!D27-D6))","v":0},{"$f":"IF(Summary!E27-E6<0,0,SUM(Summary!E27-E6))","v":0},{"$f":"IF(Summary!F27-F6<0,0,SUM(Summary!F27-F6))","v":0},{"$f":"IF(Summary!G27-G6<0,0,SUM(Summary!G27-G6))","v":0},{"$f":"IF(Summary!H27-H6<0,0,SUM(Summary!H27-H6))","v":0},{"$f":"IF(Summary!I27-I6<0,0,SUM(Summary!I27-I6))","v":0}]
[null,"Total Costs",{"$f":"IF(Summary!C31-C6<0,0,SUM(Summary!C31-C6))","v":129.39199232527562},{"$f":"IF(Summary!D31-D6<0,0,SUM(Summary!D31-D6))","v":75.524048756759157},{"$f":"IF(Summary!E31-E6<0,0,SUM(Summary!E31-E6))","v":190.09471474775205},{"$f":"IF(Summary!F31-F6<0,0,SUM(Summary!F31-F6))","v":227.15459291143992},{"$f":"IF(Summary!G31-G6<0,0,SUM(Summary!G31-G6))","v":212.48778849968187},{"$f":"IF(Summary!H31-H6<0,0,SUM(Summary!H31-H6))","v":33.514479613452863},{"$f":"IF(Summary!I31-I6<0,0,SUM(Summary!I31-I6))","v":167.87591443128497}]
[]
["AgriInsurance Risk Ratio",null,"(AgriInsurance Coverage / Cost)"]
[null,"Operating Costs",{"$f":"SUM(C6/Summary!C21)","v":1.1063038801600769},{"$f":"SUM(D6/Summary!D21)","v":1.2626027114740221},{"$f":"SUM(E6/Summary!E21)","v":0.98270388561989641},{"$f":"SUM(F6/Summary!F21)","v":0.78138021040446537},{"$f":"SUM(G6/Summary!G21)","v":0.81341029661669972},{"$f":"SUM(H6/Summary!H21)","v":1.4876881770774502},{"$f":"SUM(I6/Summary!I21)","v":1.0134642319608875}]
{"$rows_left_out":50}
{"sheet":"Charts","index":3,"n_rows":0,"n_cols":0,"rows_kept":0,"cut":false,"hidden":false,"merged":[]}

{"sheet":"Seed, Fertilizer & Chemical","index":4,"n_rows":56,"n_cols":46,"rows_kept":56,"cut":false,"hidden":false,"merged":[[36,1,38,14],[40,0,40,14],[0,0,0,14],[11,0,11,14],[22,2,22,12],[23,2,23,3],[23,5,23,6],[23,8,23,9],[23,11,23,12],[33,1,34,14]]}
["Seed & Treatment"]
[null,null,null,"Seeding Rate",null,null,"Price",null,null,"Cost"]
["Crop",null,null,"per Acre",null,null,"per Unit",null,null,"per Acre"]
[null,"Hempseed",null,25,"lb",null,2.35,"/lb",null,{"$f":"ROUND(D4*G4,2)","v":58.75}]
[null,"Black Bean",null,1.25,"unit",null,77,"/unit",null,96.25]
[null,"Kidney Bean",null,1.1000000000000001,"unit",null,209,"/unit",null,229.9]
[null,"Buckwheat",null,1,"bu",null,25,"/bu",null,25]
[null,"Canaryseed",null,44,"lb",null,0.75,"/lb",null,33]
[null,"Fababean",null,180,"lb",null,0.22,"/lb",null,39.6]
[null,"Lentil",null,2,"bu",null,35,"/bu",null,70]
[]
["Fertilizer"]
[null,null,null,"Bulk Price",null,null,"Actual Nutrient",null,null,"Nitrogen",null,null,"Sulphur"]
["Fertilizer Type",null,null,"$/tonne",null,null,"$/lb",null,null,"Usage",null,null,"Usage"]
[null,"Nitrogen: (urea) 46-0-0",null,1090,null,null,{"$f":"SUM(D15/(2204.5855*0.46))","v":1.0748348010958542},null,null,0.75,null,null," -"]
{"$rows_left_out":42}
{"sheet":"Op. Cost Input","index":5,"n_rows":34,"n_cols":29,"rows_kept":34,"cut":false,"hidden":false,"merged":[[0,0,0,13],[24,4,25,4],[24,5,25,5],[24,6,25,6],[24,7,25,7],[24,8,25,8],[24,9,25,9],[21,0,21,13],[10,8,10,13],[9,4,9,13],[24,10,25,10],[24,11,25,11],[24,12,25,12],[24,13,25,13],[23,12,23,13],[23,4,23,11]]}
["Operating Costs"]
[]
[null,"Interest Rate on Operating",null,0.05,null,null,"Grain Hauling",null,null,null,null,null,null,null,null,null,null,"# Hired","# of","Acres","Hours "]
[null,"Land Taxes  ($/acre)",null,17.5,null,null,"  Distance to storage",null,6,"miles roundtrip",null,null,null,null,null,null,null,"Staff","Months","Farmed","Per Acre"]
[null,"Labour rate ($/hour)",null,25,null,null,"  Distance to market",null,45,"miles roundtrip",null,null,null,null,null,null,null,1,12,{"$f":"'Fixed Cost Input'!D5+'Fixed Cost Input'!D6","v":2500},{"$f":"SUM(R5*S5*4*40)/T5","v":0.76800000000000002}]
[null,"Machinery Operating  ($/acre)",null,20,null,null,"  Grain truck fuel use",null,5,"Miles per Imp. Gallon",null,null,null,null,null,null,null,1,4,{"$f":"T5","v":2500},{"$f":"SUM(R6*S6*4*40)/T6","v":0.25600000000000001}]
[null,"Other Costs ($/acre)",null,17.75,null,null,"  Grain truck size",null,475,"bushels",null,null,null,null,null,null,null,0,0,{"$f":"T5","v":2500},{"$f":"SUM(R7*S7*4*40)/T7","v":0}]
[null,"Fuel Cost  ($/litre)",null,1.1499999999999999,null,null,null,null,null,null,null,null,null,null,null,null,null,0,0,{"$f":"T5","v":2500},{"$f":"SUM(R8*S8*4*40)/T8","v":0}]
[null,"Owners - Labour & Living (hrs/acre)",null,1,null,null,null,null,null,null,null,null,null,null,null,null,null,null,null,"Total",{"$f":"SUM(U5:U8)","v":1.024}]
[null,null,null,null,"Operating Cost ($/Acre)"]
[null,null,"Labour",null,"Crop*","Hail","Drying","Storage","Rental and Custom Costs"]
["Crop",null,"(hrs/acre)","Fuel","Insurance","Insurance","Costs","$/acre**","Seeding","Application","Swathing","Harvest","General","Total"]
[null,{"$f":"'Seed, Fertilizer & Chemical'!B4","v":"Hempseed"},0.2,{"$f":"SUM($D$8*D28)","v":24.453561483253587},{"$f":"MROUND(HLOOKUP('Data (HIDE)'!$V$14,'Data (HIDE)'!$C$68:$G$75,2,FALSE)+'Data (HIDE)'!$D$77,0.25)","v":36.75},{"$f":"HLOOKUP('Data (HIDE)'!$W$14,'Data (HIDE)'!$D$82:$H$90,3,FALSE)","v":18.899999999999999},"-",{"$f":"-PMT('Fixed Cost Input'!$C$11,20,(HLOOKUP('Data (HIDE)'!$B$13,'Data (HIDE)'!$C$46:$G$53,2,FALSE)/44*(('Fixed Cost Input'!$C$17*'Fixed Cost Input'!$D$17)+('Fixed Cost Input'!$C$18*'Fixed Cost Input'!$D$18)+('Fixed Cost Input'!$C$19*'Fixed Cost Input'!$D$19))*'Fixed Cost Input'!$D$20),0)","v":2.7817029855766728},"-","-","-","-","-",{"$f":"SUM(I13:M13)","v":0},null,null,null,null,null,null,null,null,null,null,null,null,null,{"$f":"IF('Data (HIDE)'!$B$14=\"80% Insured Value\",HLOOKUP('Data (HIDE)'!$V$14,'Data (HIDE)'!$C$68:$G$75,2,FALSE),IF('Data (HIDE)'!$B$14=\"70% Insured Value\",HLOOKUP('Data (HIDE)'!$V$14,'Data (HIDE)'!#REF!,2,FALSE),HLOOKUP('Data (HIDE)'!$V$14,'Data (HIDE)'!#REF!,2,FALSE)))+'Data (HIDE)'!$D$77","v":36.662999999999997},{"$f":"HLOOKUP('Data (HIDE)'!$W$14,'Data (HIDE)'!$D$82:$H$90,3,FALSE)","v":18.899999999999999}]
[null,{"$f":"'Seed, Fertilizer & Chemical'!B5","v":"Black Bean"},0.2,23.880764421052632,{"$f":"MROUND(HLOOKUP('Data (HIDE)'!$V$14,'Data (HIDE)'!$C$68:$G$75,3,FALSE)+'Data (HIDE)'!$D$77,0.25)","v":33.5},{"$f":"HLOOKUP('Data (HIDE)'!$W$14,'Data (HIDE)'!$D$82:$H$90,4,FALSE)","v":16.537499999999998},"-",{"$f":"-PMT('Fixed Cost Input'!$C$11,20,(HLOOKUP('Data (HIDE)'!$B$13,'Data (HIDE)'!$C$46:$G$53,3,FALSE)/60*(('Fixed Cost Input'!$C$17*'Fixed Cost Input'!$D$17)+('Fixed Cost Input'!$C$18*'Fixed Cost Input'!$D$18)+('Fixed Cost Input'!$C$19*'Fixed Cost Input'!$D$19))*'Fixed Cost Input'!$D$20),0)","v":4.6238085182474471},"-","-","-","-","-",{"$f":"SUM(I14:M14)","v":0},null,null,null,null,null,null,null,null,null,null,null,null,null,{"$f":"IF('Data (HIDE)'!$B$14=\"80% Insured Value\",HLOOKUP('Data (HIDE)'!$V$14,'Data (HIDE)'!$C$68:$G$75,3,FALSE),IF('Data (HIDE)'!$B$14=\"70% Insured Value\",HLOOKUP('Data (HIDE)'!$V$14,'Data (HIDE)'!#REF!,3,FALSE),HLOOKUP('Data (HIDE)'!$V$14,'Data (HIDE)'!#REF!,3,FALSE)))+'Data (HIDE)'!$D$77","v":33.471000000000004},{"$f":"HLOOKUP('Data (HIDE)'!$W$14,'Data (HIDE)'!$D$82:$H$90,4,FALSE)","v":16.537499999999998}]
[null,{"$f":"'Seed, Fertilizer & Chemical'!B6","v":"Kidney Bean"},0.2,23.319453052631577,{"$f":"MROUND(HLOOKUP('Data (HIDE)'!$V$14,'Data (HIDE)'!$C$68:$G$75,4,FALSE)+'Data (HIDE)'!$D$77,0.25)","v":48.25},{"$f":"HLOOKUP('Data (HIDE)'!$W$14,'Data (HIDE)'!$D$82:$H$90,5,FALSE)","v":16.537499999999998},"-",{"$f":"-PMT('Fixed Cost Input'!$C$11,20,(HLOOKUP('Data (HIDE)'!$B$13,'Data (HIDE)'!$C$46:$G$53,4,FALSE)/60*(('Fixed Cost Input'!$C$17*'Fixed Cost Input'!$D$17)+('Fixed Cost Input'!$C$18*'Fixed Cost Input'!$D$18)+('Fixed Cost Input'!$C$19*'Fixed Cost Input'!$D$19))*'Fixed Cost Input'!$D$20),0)","v":3.8078423091449567},"-","-","-","-","-",0,null,null,null,null,null,null,null,null,null,null,null,null,null,{"$f":"IF('Data (HIDE)'!$B$14=\"80% Insured Value\",HLOOKUP('Data (HIDE)'!$V$14,'Data (HIDE)'!$C$68:$G$75,4,FALSE),IF('Data (HIDE)'!$B$14=\"70% Insured Value\",HLOOKUP('Data (HIDE)'!$V$14,'Data (HIDE)'!#REF!,4,FALSE),HLOOKUP('Data (HIDE)'!$V$14,'Data (HIDE)'!#REF!,4,FALSE)))+'Data (HIDE)'!$D$77","v":48.131999999999991},{"$f":"HLOOKUP('Data (HIDE)'!$W$14,'Data (HIDE)'!$D$82:$H$90,5,FALSE)","v":16.537499999999998}]
{"$rows_left_out":20}
{"sheet":"Fixed Cost Input","index":6,"n_rows":63,"n_cols":10,"rows_kept":63,"cut":false,"hidden":false,"merged":[[0,0,0,9],[21,0,21,9],[45,0,45,9],[53,0,53,9]]}
["Fixed Costs"]
[]
[null,"Land",null,null,null,null,null,null,"Conventional","Special"]
[null,"  Average Land value ($/acre)",null,3400,null,null,"Machinery",null,"Crop","Crop"]
[null,"  Conventional Crop acres",null,2000,null,null,"  Total Investment ($/acre)",null,{"$f":"ROUND((C44)/(D5+D6),2)","v":500},{"$f":"ROUND((C52)/(D6+D5),2)","v":60}]
[null,"  Special Crop acres",null,500,null,null,"  Residual Value (End of Useful Life)",null,0.25]
[null,"  Owned Land Equity",null,0.85,null,null,"  Useful Life (years)",null,15]
[null,"  Land Financed",null,{"$f":"SUM(1-D7)","v":0.15000000000000002},null,null,"  Owned Equipment Equity",null,0.55000000000000004]
[null,"  Land Opportunity Cost (Investment Rate) ",null,1.4999999999999999E-2,null,null,"  Equipment Financed",null,{"$f":"SUM(1-I8)","v":0.44999999999999996}]
[null,"Land cost ($/acre)",null,null,null,null,"  Machinery Opportunity Cost (Investment Rate) ",null,1.4999999999999999E-2]
[null,"  Finance Rate & Term",4.6249999999999999E-2,25,"Years"]
[null,"  Principle & Interest Cost",null,{"$f":"-PMT(C11,D11,D4*D8,0)","v":34.837793996234424},null,null,"Machinery Cost ($/acre)"]
[null,"  Owned Land Opportunity Cost",null,{"$f":"SUM(D4*D7)*(D9)","v":43.35},null,null,"  Finance Rate & Term",0.05,7,"Years"]
[null,"  Total Cost",null,{"$f":"SUM(D12:D13)","v":78.187793996234433},null,null,"  Principle & Interest Cost",null,{"$f":"-PMT(H13,I13,I5*I9,0)","v":38.884459150388409},{"$f":"-PMT(H13,I13,J5*I9,0)","v":4.6661350980466088}]
[null,null,null,null,null,null,"  Machinery Depreciation Cost",null,{"$f":"(I5-(I5*I6))/I7","v":25},{"$f":"(J5-(J5*I6))/I7","v":3}]
{"$rows_left_out":49}
{"sheet":"Assumptions","index":7,"n_rows":61,"n_cols":12,"rows_kept":61,"cut":false,"hidden":false,"merged":[[42,0,43,11],[4,0,5,11],[13,0,13,11],[0,0,0,11],[8,0,9,11],[18,0,19,11],[24,0,26,11]]}
["Other Assumptions"]
[]
["Fuel Costs:  Includes fuel used for field work, trucking in inputs and trucking out production."]
[]
["Machinery  Operating Costs:  Includes costs for maintenance, repairs, licenses and insurance, based on 3.2% of machinery investment cost."]
[]
[]
["Crop Insurance: (2021 rates) "]
[{"$f":"IF('Data (HIDE)'!B13=\"Manitoba\",'Data (HIDE)'!B14&\" coverage, $50/acre excess moisture Insurance, and additional hail insurance at $\"&'Data (HIDE)'!W13&\"/acre coverage for all crops.  Coverage and costs based on MASC Risk Areas #2, 5, 6, and 12.\",'Data (HIDE)'!B14&\" coverage, $50/acre excess moisture Insurance, and additional hail insurance at $\"&'Data (HIDE)'!W13&\"/acre coverage for all crops.  Coverage and costs based on MASC \"&'Data (HIDE)'!B13)","v":"80% Insured Value coverage, $50/acre excess moisture Insurance, and additional hail insurance at $300/acre coverage for all crops.  Coverage and costs based on MASC Risk Areas #2, 5, 6, and 12."}]
[]
[]
["Other Costs:  Includes overhead expenses - hydro, telephone, accounting, buildings, supplies and insurance, etc."]
[]
["Land Taxes:  The average cost based on land tax assessment and mill rates of a sample of municipalities growing crops less provincial tax rebate."]
[]
{"$rows_left_out":47}
{"sheet":"Chart data (HIDE)","index":8,"n_rows":12,"n_cols":12,"rows_kept":12,"cut":false,"hidden":true,"merged":[]}
[]
[{"$f":"'Data (HIDE)'!B13&\" Breakeven Yield Risk Ratio - \"&Introduction!I11","v":"Manitoba Breakeven Yield Risk Ratio - 2022"}]
[{"$f":"'Data (HIDE)'!B13&\" Risk & Reward Analysis - \"&Introduction!I11","v":"Manitoba Risk & Reward Analysis - 2022"},null,null,null,"80% Coverage of Total Costs"]
[{"$f":"'Data (HIDE)'!B13&\" - \"&'Data (HIDE)'!B14&\" AgriInsurance Risk Analysis - \"&Introduction!I11","v":"Manitoba - 80% Insured Value AgriInsurance Risk Analysis - 2022"}]
[null,"Operating Costs",{"$f":"'Data (HIDE)'!B14","v":"80% Insured Value"},"80% Coverage of Operating Costs","80% Coverage of Total Costs (Risk)","Return on Asset (Reward)","Return on Investment (Reward)",null,null,null,null,"Target Yield as % of B/E Yield"]
[{"$f":"'Data (HIDE)'!B16","v":"Black Bean"},{"$f":"'Data (HIDE)'!AC16","v":470.03360408060621},{"$f":"'Data (HIDE)'!AJ16","v":520},{"$f":"'Data (HIDE)'!AV16","v":1.1063038801600769},{"$f":"'Data (HIDE)'!AW16","v":0.80074901776666174},{"$f":"'Data (HIDE)'!AS16","v":6.1102625232170152E-2},{"$f":"'Data (HIDE)'!AT16","v":0.17802499729133892},null,null,null,null,{"$f":"'Data (HIDE)'!AX16","v":1.1780195412653316}]
[{"$f":"'Data (HIDE)'!B17","v":"Hempseed"},{"$f":"'Data (HIDE)'!AC17","v":364.32679561013634},{"$f":"'Data (HIDE)'!AJ17","v":460},{"$f":"'Data (HIDE)'!AV17","v":1.2626027114740221},{"$f":"'Data (HIDE)'!AW17","v":0.85897169523555239},{"$f":"'Data (HIDE)'!AS17","v":6.5826566765117084E-2},{"$f":"'Data (HIDE)'!AT17","v":0.26044759626956049},null,null,null,null,{"$f":"'Data (HIDE)'!AX17","v":1.2605042016806722}]
[{"$f":"'Data (HIDE)'!B18","v":"Kidney Bean"},{"$f":"'Data (HIDE)'!AC18","v":620.73632650308264},{"$f":"'Data (HIDE)'!AJ18","v":610},{"$f":"'Data (HIDE)'!AV18","v":0.98270388561989641},{"$f":"'Data (HIDE)'!AW18","v":0.76240973569275017},{"$f":"'Data (HIDE)'!AS18","v":3.096887246696304E-3},{"$f":"'Data (HIDE)'!AT18","v":-0.14260151035208748},null,null,null,null,{"$f":"'Data (HIDE)'!AX18","v":0.85742283194512492}]
[{"$f":"'Data (HIDE)'!B19","v":"Fababean"},{"$f":"'Data (HIDE)'!AC19","v":255.95733976481708},{"$f":"'Data (HIDE)'!AJ19","v":200},{"$f":"'Data (HIDE)'!AV19","v":0.78138021040446537},{"$f":"'Data (HIDE)'!AW19","v":0.46821456053374361},{"$f":"'Data (HIDE)'!AS19","v":3.8899661675551242E-2},{"$f":"'Data (HIDE)'!AT19","v":7.6893489227610329E-2},null,null,null,null,{"$f":"'Data (HIDE)'!AX19","v":1.0768798576645753}]
[{"$f":"'Data (HIDE)'!B20","v":"Buckwheat"},{"$f":"'Data (HIDE)'!AC20","v":221.290535353059},{"$f":"'Data (HIDE)'!AJ20","v":180},{"$f":"'Data (HIDE)'!AV20","v":0.81341029661669972},{"$f":"'Data (HIDE)'!AW20","v":0.45861299452924481},{"$f":"'Data (HIDE)'!AS20","v":-2.2198321598633835E-3},{"$f":"'Data (HIDE)'!AT20","v":-0.33118938297818462},null,null,null,null,{"$f":"'Data (HIDE)'!AX20","v":0.66964285714285721}]
[{"$f":"'Data (HIDE)'!B21","v":"Canaryseed"},{"$f":"'Data (HIDE)'!AC21","v":282.31722646682999},{"$f":"'Data (HIDE)'!AJ21","v":420},{"$f":"'Data (HIDE)'!AV21","v":1.4876881770774502},{"$f":"'Data (HIDE)'!AW21","v":0.9261005301484122},{"$f":"'Data (HIDE)'!AS21","v":5.3076457962921722E-2},{"$f":"'Data (HIDE)'!AT21","v":0.1962131847750325},null,null,null,null,{"$f":"'Data (HIDE)'!AX21","v":1.1961722488038278}]
[{"$f":"'Data (HIDE)'!B22","v":"Lentil"},{"$f":"'Data (HIDE)'!AC22","v":246.67866128466213},{"$f":"'Data (HIDE)'!AJ22","v":250},{"$f":"'Data (HIDE)'!AV22","v":1.0134642319608875},{"$f":"'Data (HIDE)'!AW22","v":0.59826372223496438},{"$f":"'Data (HIDE)'!AS22","v":4.4399327958418652E-2},{"$f":"'Data (HIDE)'!AT22","v":0.13071843502408262},null,null,null,null,{"$f":"'Data (HIDE)'!AX22","v":1.1307669112473615}]

{"sheet":"Data (HIDE)","index":9,"n_rows":110,"n_cols":67,"rows_kept":110,"cut":false,"hidden":true,"merged":[]}
[null,"Annual Update Steps:",null,null,null,null,null,null,null,null,null,"To Do List:"]
[null,"copy & paste 'Green' data blocks below from annual MASC cost and coverage information spreadsheet."]
[null,"enter COP yields into 'yellow' data block below",null,null,null,null,null,null,null,null,null,null,null,null,null,null,null,null,null,null,null,null,null,null,null,null,null,null,null,null,null,null,null,null,null,null,null,null,null,null,null,null,null,null,null,null,null,null,null,null,null,null,null,null,null,{"$f":"V14&\" Yield per Acre - \"&Introduction!I11","v":"Manitoba Yield per Acre - 2022"}]
[null,"enter MASC insured values & COP yields into 'yellow' data blocks below"]
[null,"enter MASC SAR acres into data block below and change formula for 5 year average."]
[null,"select yellow rows and sort"]
[]
[]
[]
[]
[null,"*****Re-sort Yellow rows based on column I for 5yr Avg Ac Ranking or column K for 2018 Ranking ******   *****SUMMARY will AUTO update!! ******",null,null,null,null,null,null,null,null,null,null,null,null,"****sort on column F to reset to original listing ****"]
[null,null,null,null,null,null,null,null,null,null,null,null,null,null,null,null,null,null,null,null,null,null,"Hail Ins. coverage / acre "]
[null,"Manitoba",null,null,null,null,null,null,null,null,null,null,null,null,null,null,null,null,null,null,null,null,300]
[null,"80% Insured Value",null,null,"**Change Mkt Prices Here***",null,null,null,null,"**Change yr for Risk pg***",null,null,null,null,null,null,null,null,null,null,null,{"$f":"B13","v":"Manitoba"},{"$f":"B13","v":"Manitoba"},null,null,null,null,null,null,null,null,null,null,null,null,{"$f":"V14","v":"Manitoba"},null,null,null,null,null,null,null,null,null,null,null,"AgriInsurance Insured Value"]
[null,null,"Yield","Unit","Price","Default RANK","Manual Rank","5 yr Avg Acres","5 yr Avg Acres RANK","2021 Acres","2020 Acres RANK","Seed & Treatment","Fertilizer","Herbicide","Fungicide","Insecticide","Fuel","Machinery Operating","Machinery Lease","Rental and Custom","Labour","Crop Insurance","Hail Insurance","Other Costs","Land Taxes","Storage Costs","Drying Costs","Interest on Operating","Total Operating","Land Investment Costs","Machinery Costs","Total Fixed ","Total Operating & Fixed","Labour","Total Costs","Insured value","% Premium","Gross Revenue","Margin Over Total Costs (Net Profit)","Operating Expense Ratio","B/E Price Over Total Costs","Breakeven Yield Over Total Costs","B/E Yield Risk Ratio","AgriInsurance Risk Ratio","Estimated ROA (Reward)","Estimated ROI (Reward)",null,"% of Op Cost","% of Total Costs","Target or Average Yield as % of B/E Yield"]
{"$rows_left_out":95}