{"text_format":"1","workbook":"xlsx","n_sheets":38,"sheets":["Calculator","NAMES","DATA","Instructions","Sprayer Water Calc","Editing notes","Summary","Power Units-2Wheel Drive","Power Units-4 Wheel Drive","Harvesting Grain- Sp Combines","Harvest Combine (2)","Harvesting Grain CombineHeaders","Harvesting Grain Swathers","Harvesting Grain Power Auger","Harvesting Hay- SP Forage ","Harvesting Hay SP Mower","Harvesting Hay Balers","Harvesting Hay PT Bale Movers","Seeding Air Drills ","Seeding AirDiskDrill","Seeding Other Row Crop Planters","Soil Preparation Cultivators","Soil Preparation Harrows","Soil Prep- Land Roller","Sprayers High Clearance","Misc. Post Pounder, Feed Mixers","Misc. Grain Bagger, Conveyor ","Misc. Spreader Loader","Appendix A","Appendix B","Appendix C","Appendix D (pg1)","Appendix D (pg2)","Appendix E","Appendix F(p1)","Appendix F(p2)","Appendix F(p3)","Appendix F(p4)"],"not_rendered":{"charts":0,"images":6,"macros":1,"external_links":0,"defined_names":106,"comments":0,"pivot_tables":0},"unopened":[],"bounds":{"document_bytes":16777216,"sheet_cells":100000,"rows_first":2000,"rows_last":500,"rows_between":2000,"halvings":0,"cell_chars":16384,"cell_head_chars":4096},"cells_cut":0,"cells_raw":0,"read":"whole","date_system":"1900"}

{"sheet":"Calculator","index":0,"n_rows":88,"n_cols":26,"rows_kept":88,"cut":false,"hidden":false,"merged":[[84,0,85,14],[22,18,22,19],[24,18,24,19],[26,18,26,19],[68,1,68,3],[75,1,75,3],[22,8,22,9],[22,11,22,12],[39,1,39,3],[50,1,50,13],[22,5,22,6],[67,1,67,13],[60,1,60,3],[26,11,26,12],[24,5,24,6],[51,11,51,12],[32,1,32,3],[22,24,22,25],[44,1,44,3],[24,24,24,25],[26,21,26,22],[26,24,26,25],[26,5,26,6],[26,8,26,9],[22,21,22,22],[13,1,13,13],[21,11,21,12],[24,21,24,22],[18,16,18,27],[17,9,17,13],[24,11,24,12],[24,8,24,9],[21,24,21,25]]}
[]
[]
[]
[]
[]
[]
[]
[]
[]
[]
[]
[]
[]
[null,"Machinery Information"]
[]
[null,null,"Fuel Price (per litre)",1.4,null,"Machinery Financed",null,null,0.5,null,null,null,"v1.0"]
[null,null,"Labour rate (per hour)",27,null,"Interest Rate",null,null,8.5000000000000006E-2]
[null,null,"Field Efficiency Rate",0.8,null,"Opportunity Cost Rate",null,null,1.4999999999999999E-2,"*** Enter any changes to BLUE values only ***"]
[null,null,"Rental & Custom Margin",0.15,null,"Loan Payback Period (years)",null,null,7,null,null,null,null,null,null,null,"****HIDE****"]
[null,null,"Insurance and Housing",0.01,null,"Opportunity Cost Period (years)",null,null,7]
[]
[null,null,null,null,null,"Implement #1",null,null,"Implement #2",null,null,"Implement #3",null,null,null,null,null,null,"Implement #1",null,null,"Implement #2",null,null,"Implement #3"]
[null,"1. Select category:",null,null,null,"(Select Category)",null,null,"(Select Category)",null,null,"(Select Category)",null,null,null,null,null,null,"(Select Category)",null,null,"(Select Category)",null,null,"(Select Category)"]
[]
[null,"2. Select farm equipment:"]
[]
[null,"3. Select equipment size:"]
[null,null,"***HIDE ROW***",null,null,{"$f":"F23&\" \"&F25&\" \"&F27","v":"(Select Category)  "},null,null,{"$f":"I23&\" \"&I25&\" \"&I27","v":"(Select Category)  "},null,null,{"$f":"L23&\" \"&L25&\" \"&L27","v":"(Select Category)  "},null,null,null,null,null,null,{"$f":"S23&\" \"&S25&\" \"&S27","v":"(Select Category)  "},null,null,{"$f":"V23&\" \"&V25&\" \"&V27","v":"(Select Category)  "},null,null,{"$f":"Y23&\" \"&Y25&\" \"&Y27","v":"(Select Category)  "}]
[]
[]
[]
[]
[null,"4. Purchasing Information"]
[null,"Equipment value ",null,null,null,{"$f":"IF(F27=\"\",0,VLOOKUP($F$28,DATA!$A$6:$AQ$196,6,FALSE))","v":0},null,null,{"$f":"IF(I27=\"\",0,VLOOKUP($I$28,DATA!$A$6:$AQ$196,6,FALSE))","v":0},null,null,{"$f":"IF(L27=\"\",0,VLOOKUP($L$28,DATA!$A$6:$AQ$196,6,FALSE))","v":0},null,null,null,null,null,null,{"$f":"IF(S27=\"\",0,VLOOKUP($F$28,DATA!$A$6:$AQ$196,6,FALSE))","v":0},null,null,{"$f":"IF(V27=\"\",0,VLOOKUP($I$28,DATA!$A$6:$AQ$196,6,FALSE))","v":0},null,null,{"$f":"IF(Y27=\"\",0,VLOOKUP($L$28,DATA!$A$6:$AQ$196,6,FALSE))","v":0}]
[null,"Annual hours of usage",null,null,null,{"$f":"IF(F27=\"\",0,VLOOKUP($F$28,DATA!$A$6:$AQ$196,25,FALSE))","v":0},"hours",null,{"$f":"IF(I27=\"\",0,VLOOKUP($I$28,DATA!$A$6:$AQ$196,25,FALSE))","v":0},"hours",null,{"$f":"IF(L27=\"\",0,VLOOKUP($L$28,DATA!$A$6:$AQ$196,25,FALSE))","v":0},"hours",null,null,null,null,null,{"$f":"IF(S27=\"\",0,VLOOKUP($F$28,DATA!$A$6:$AQ$196,25,FALSE))","v":0},"hours",null,{"$f":"IF(V27=\"\",0,VLOOKUP($I$28,DATA!$A$6:$AQ$196,25,FALSE))","v":0},"hours",null,{"$f":"IF(Y27=\"\",0,VLOOKUP($L$28,DATA!$A$6:$AQ$196,25,FALSE))","v":0},"hours"]
[null,"Optimal life for equipment",null,null,null,{"$f":"IF(F27=\"\",0,VLOOKUP($F$28,DATA!$A$6:$AQ$196,24,FALSE))","v":0},"years",null,{"$f":"IF(I27=\"\",0,VLOOKUP($I$28,DATA!$A$6:$AQ$196,24,FALSE))","v":0},"years",null,{"$f":"IF(L27=\"\",0,VLOOKUP($L$28,DATA!$A$6:$AQ$196,24,FALSE))","v":0},"years",null,null,null,null,null,{"$f":"IF(S27=\"\",0,VLOOKUP($F$28,DATA!$A$6:$AQ$196,24,FALSE))","v":0},"years",null,{"$f":"IF(V27=\"\",0,VLOOKUP($I$28,DATA!$A$6:$AQ$196,24,FALSE))","v":0},"years",null,{"$f":"IF(Y27=\"\",0,VLOOKUP($L$28,DATA!$A$6:$AQ$196,24,FALSE))","v":0},"years"]
[null,"Depreciation over optimal life",null,null,null,{"$f":"IF(F34=0,0,Fraction_dep_over_optimal_life)","v":0},null,null,{"$f":"IF(I34=0,0,Fraction_dep_over_optimal_life)","v":0},null,null,{"$f":"IF(L34=0,0,Fraction_dep_over_optimal_life)","v":0},null,null,null,null,null,null,{"$f":"IF(S34=0,0,Fraction_dep_over_optimal_life)","v":0},null,null,{"$f":"IF(V34=0,0,Fraction_dep_over_optimal_life)","v":0},null,null,{"$f":"IF(Y34=0,0,Fraction_dep_over_optimal_life)","v":0}]
[null,"Retained value at end of optimal life",null,null,null,{"$f":"F34*(1-F37)","v":0},null,null,{"$f":"I34*(1-I37)","v":0},null,null,{"$f":"L34*(1-L37)","v":0},null,null,null,null,null,null,{"$f":"S34*(1-S37)","v":0},null,null,{"$f":"V34*(1-V37)","v":0},null,null,{"$f":"Y34*(1-Y37)","v":0}]
[]
[null,"5. Other"]
[null,"Fuel used per hour",null,null,null,{"$f":"IF(F27=\"\",0,VLOOKUP($F$28,DATA!$A$6:$AQ$196,27,FALSE))","v":0},"Litres",null,{"$f":"IF(I27=\"\",0,VLOOKUP($I$28,DATA!$A$6:$AQ$196,27,FALSE))","v":0},"Litres",null,{"$f":"IF(L27=\"\",0,VLOOKUP($L$28,DATA!$A$6:$AQ$196,27,FALSE))","v":0},"Litres",null,null,null,null,null,{"$f":"IF(S27=\"\",0,VLOOKUP($F$28,DATA!$A$6:$AQ$196,27,FALSE))","v":0},"Litres",null,{"$f":"IF(V27=\"\",0,VLOOKUP($I$28,DATA!$A$6:$AQ$196,27,FALSE))","v":0},"Litres",null,{"$f":"IF(Y27=\"\",0,VLOOKUP($L$28,DATA!$A$6:$AQ$196,27,FALSE))","v":0},"Litres"]
[null,"Annual repair and maintenance (R&M) rate",null,null,null,{"$f":"IF(F27=\"\",0,(VLOOKUP($F$28,DATA!$A$6:$AQ$196,26,FALSE)/100))","v":0},null,null,{"$f":"IF(I27=\"\",0,(VLOOKUP($I$28,DATA!$A$6:$AQ$196,26,FALSE)/100))","v":0},null,null,{"$f":"IF(L27=\"\",0,(VLOOKUP($L$28,DATA!$A$6:$AQ$196,26,FALSE)/100))","v":0},null,null,null,null,null,null,{"$f":"IF(S27=\"\",0,(VLOOKUP($F$28,DATA!$A$6:$AQ$196,26,FALSE)/100))","v":0},null,null,{"$f":"IF(V27=\"\",0,(VLOOKUP($I$28,DATA!$A$6:$AQ$196,26,FALSE)/100))","v":0},null,null,{"$f":"IF(Y27=\"\",0,(VLOOKUP($L$28,DATA!$A$6:$AQ$196,26,FALSE)/100))","v":0}]
[null,"Annual R&M cost",null,null,null,{"$f":"F42*F34","v":0},null,null,{"$f":"I42*I34","v":0},null,null,{"$f":"L42*L34","v":0},null,null,null,null,null,null,{"$f":"S42*S34","v":0},null,null,{"$f":"V42*V34","v":0},null,null,{"$f":"Y42*Y34","v":0}]
[]
[null,"6. Work Rate Information"]
[null,"Speed",null,null,null,{"$f":"IF(F27=\"\",0,IF(VLOOKUP($F$28,DATA!$A$6:$AQ$196,28,FALSE)=\"\",\"n/a\",VLOOKUP($F$28,DATA!$A$6:$AQ$196,28,FALSE)))","v":0},"mph",null,{"$f":"IF(I27=\"\",0,IF(VLOOKUP($I$28,DATA!$A$6:$AQ$196,28,FALSE)=\"\",\"n/a\",VLOOKUP($I$28,DATA!$A$6:$AQ$196,28,FALSE)))","v":0},"mph",null,{"$f":"IF(L27=\"\",0,IF(VLOOKUP($L$28,DATA!$A$6:$AQ$196,28,FALSE)=\"\",\"n/a\",VLOOKUP($L$28,DATA!$A$6:$AQ$196,28,FALSE)))","v":0},"mph",null,null,null,null,null,{"$f":"IF(S27=\"\",0,IF(VLOOKUP($F$28,DATA!$A$6:$AQ$196,28,FALSE)=\"\",\"n/a\",VLOOKUP($F$28,DATA!$A$6:$AQ$196,28,FALSE)))","v":0},"mph",null,{"$f":"IF(V27=\"\",0,IF(VLOOKUP($I$28,DATA!$A$6:$AQ$196,28,FALSE)=\"\",\"n/a\",VLOOKUP($I$28,DATA!$A$6:$AQ$196,28,FALSE)))","v":0},"mph",null,{"$f":"IF(Y27=\"\",0,IF(VLOOKUP($L$28,DATA!$A$6:$AQ$196,28,FALSE)=\"\",\"n/a\",VLOOKUP($L$28,DATA!$A$6:$AQ$196,28,FALSE)))","v":0},"mph"]
[null,"Implement width",null,null,null,{"$f":"IF(F27=\"\",0,IF(VLOOKUP($F$28,DATA!$A$6:$AQ$196,29,FALSE)=\"\",\"n/a\",VLOOKUP($F$28,DATA!$A$6:$AQ$196,29,FALSE)))","v":0},"feet",null,{"$f":"IF(I27=\"\",0,IF(VLOOKUP($I$28,DATA!$A$6:$AQ$196,29,FALSE)=\"\",\"n/a\",VLOOKUP($I$28,DATA!$A$6:$AQ$196,29,FALSE)))","v":0},"feet",null,{"$f":"IF(L27=\"\",0,IF(VLOOKUP($L$28,DATA!$A$6:$AQ$196,29,FALSE)=\"\",\"n/a\",VLOOKUP($L$28,DATA!$A$6:$AQ$196,29,FALSE)))","v":0},"feet",null,null,null,null,null,{"$f":"IF(S27=\"\",0,IF(VLOOKUP($F$28,DATA!$A$6:$AQ$196,29,FALSE)=\"\",\"n/a\",VLOOKUP($F$28,DATA!$A$6:$AQ$196,29,FALSE)))","v":0},"feet",null,{"$f":"IF(V27=\"\",0,IF(VLOOKUP($I$28,DATA!$A$6:$AQ$196,29,FALSE)=\"\",\"n/a\",VLOOKUP($I$28,DATA!$A$6:$AQ$196,29,FALSE)))","v":0},"feet",null,{"$f":"IF(Y27=\"\",0,IF(VLOOKUP($L$28,DATA!$A$6:$AQ$196,29,FALSE)=\"\",\"n/a\",VLOOKUP($L$28,DATA!$A$6:$AQ$196,29,FALSE)))","v":0},"feet"]
[null,"Field efficiency",null,null,null,{"$f":"IF(F34=0,0,IF(F25=\"High_Clearance_Sprayer\",Field_efficiency*0.8,Field_efficiency))","v":0},null,null,{"$f":"IF(I34=0,0,IF(I25=\"High_Clearance_Sprayer\",Field_efficiency*0.8,Field_efficiency))","v":0},null,null,{"$f":"IF(L34=0,0,IF(L25=\"High_Clearance_Sprayer\",Field_efficiency*0.8,Field_efficiency))","v":0},null,null,null,null,null,null,{"$f":"IF(S34=0,0,IF(S25=\"High_Clearance_Sprayer\",Field_efficiency*0.8,Field_efficiency))","v":0},null,null,{"$f":"IF(V34=0,0,IF(V25=\"High_Clearance_Sprayer\",Field_efficiency*0.8,Field_efficiency))","v":0},null,null,{"$f":"IF(Y34=0,0,IF(Y25=\"High_Clearance_Sprayer\",Field_efficiency*0.8,Field_efficiency))","v":0}]
[null,"Work Rate",null,null,null,{"$f":"IF(OR(F46=\"n/a\",F47=\"n/a\",F48=0),\"n/a\",IF(OR(F46=0,F47=0),VLOOKUP($F$28,DATA!$A$6:$AQ$196,30,FALSE),ROUND((F46*5280*F47*F48)/43560,0)))","v":"n/a"},{"$f":"IF(F49=\"n/a\",\"\",IF(VLOOKUP($F$28,DATA!$A$6:$AQ$196,31,FALSE)=\"\",\"\",VLOOKUP($F$28,DATA!$A$6:$AQ$196,31,FALSE)))","v":""},null,{"$f":"IF(OR(I46=\"n/a\",I47=\"n/a\",I48=0),\"n/a\",IF(OR(I46=0,I47=0),VLOOKUP($I$28,DATA!$A$6:$AQ$196,30,FALSE),ROUND((I46*5280*I47*I48)/43560,0)))","v":"n/a"},{"$f":"IF(I49=\"n/a\",\"\",IF(VLOOKUP($I$28,DATA!$A$6:$AQ$196,31,FALSE)=\"\",\"\",VLOOKUP($I$28,DATA!$A$6:$AQ$196,31,FALSE)))","v":""},null,{"$f":"IF(OR(L46=\"n/a\",L47=\"n/a\",L48=0),\"n/a\",IF(OR(L46=0,L47=0),VLOOKUP($L$28,DATA!$A$6:$AQ$196,30,FALSE),ROUND((L46*5280*L47*L48)/43560,0)))","v":"n/a"},{"$f":"IF(L49=\"n/a\",\"\",IF(VLOOKUP($L$28,DATA!$A$6:$AQ$196,31,FALSE)=\"\",\"\",VLOOKUP($L$28,DATA!$A$6:$AQ$196,31,FALSE)))","v":""},null,null,null,null,null,{"$f":"IF(OR(S46=\"n/a\",S47=\"n/a\",S48=0),\"n/a\",IF(OR(S46=0,S47=0),VLOOKUP($F$28,DATA!$A$6:$AQ$196,30,FALSE),ROUND((S46*5280*S47*S48)/43560,0)))","v":"n/a"},{"$f":"IF(S49=\"n/a\",\"\",IF(VLOOKUP($F$28,DATA!$A$6:$AQ$196,31,FALSE)=\"\",\"\",VLOOKUP($F$28,DATA!$A$6:$AQ$196,31,FALSE)))","v":""},null,{"$f":"IF(OR(V46=\"n/a\",V47=\"n/a\",V48=0),\"n/a\",IF(OR(V46=0,V47=0),VLOOKUP($I$28,DATA!$A$6:$AQ$196,30,FALSE),ROUND((V46*5280*V47*V48)/43560,0)))","v":"n/a"},{"$f":"IF(V49=\"n/a\",\"\",IF(VLOOKUP($F$28,DATA!$A$6:$AQ$196,31,FALSE)=\"\",\"\",VLOOKUP($F$28,DATA!$A$6:$AQ$196,31,FALSE)))","v":""},null,{"$f":"IF(OR(Y46=\"n/a\",Y47=\"n/a\",Y48=0),\"n/a\",IF(OR(Y46=0,Y47=0),VLOOKUP($L$28,DATA!$A$6:$AQ$196,30,FALSE),ROUND((Y46*5280*Y47*Y48)/43560,0)))","v":"n/a"},{"$f":"IF(Y49=\"n/a\",\"\",IF(VLOOKUP($F$28,DATA!$A$6:$AQ$196,31,FALSE)=\"\",\"\",VLOOKUP($F$28,DATA!$A$6:$AQ$196,31,FALSE)))","v":""}]
[]
[null,"Costs of Individual Implements"]
[null,"Rental Rate Costs",null,null,null,"Implement #1",null,null,"Implement #2",null,null,"Implement #3"]
[null,"Ownership (Depreciation)",null,null,null,{"$f":"IF(F35=0,0,(F34*Fraction_dep_over_optimal_life/F36/F35))","v":0},"/hr",null,{"$f":"IF(I35=0,0,(I34*Fraction_dep_over_optimal_life/I36/I35))","v":0},"/hr",null,{"$f":"IF(L35=0,0,(L34*Fraction_dep_over_optimal_life/L36/L35))","v":0},"/hr"]
[null,"Ownership (Investment)",null,null,null,{"$f":"IF(F35=0,0,IF(Machinery_Financed_percentage=0,0,(-CUMIPMT(Interest_Rate/2,Payback_loan_period_years*2,F34*Machinery_Financed_percentage,1,Payback_loan_period_years*2,0)/F36/F35))+((F34*(1-Machinery_Financed_percentage)*(1+Opportunity_Rate/12)^(Opp_inv_period_years*12)-(F34*(1-Machinery_Financed_percentage)))/F36/F35))","v":0},"/hr",null,{"$f":"IF(I35=0,0,IF(Machinery_Financed_percentage=0,0,(-CUMIPMT(Interest_Rate/2,Payback_loan_period_years*2,I34*Machinery_Financed_percentage,1,Payback_loan_period_years*2,0)/I36/I35))+((I34*(1-Machinery_Financed_percentage)*(1+Opportunity_Rate/12)^(Opp_inv_period_years*12)-(I34*(1-Machinery_Financed_percentage)))/I36/I35))","v":0},"/hr",null,{"$f":"IF(L35=0,0,IF(Machinery_Financed_percentage=0,0,(-CUMIPMT(Interest_Rate/2,Payback_loan_period_years*2,L34*Machinery_Financed_percentage,1,Payback_loan_period_years*2,0)/L36/L35))+((L34*(1-Machinery_Financed_percentage)*(1+Opportunity_Rate/12)^(Opp_inv_period_years*12)-(L34*(1-Machinery_Financed_percentage)))/L36/L35))","v":0},"/hr",null,null,null,null,null,{"$f":"IF(F35=0,0,(F34*Fraction_dep_over_optimal_life/F36/F35)+IF(Machinery_Financed_percentage=0,0,(-CUMIPMT(Interest_Rate/2,Payback_loan_period_years*2,F34*Machinery_Financed_percentage,1,Payback_loan_period_years*2,0)/F36/F35))+((F34*(1-Machinery_Financed_percentage)*(1+Opportunity_Rate/12)^(Opp_inv_period_years*12)-(F34*(1-Machinery_Financed_percentage)))/F36/F35)+(Insurance_and_Housing*F34/F35))","v":0}]
[null,"Ownership (Insurance and Housing)",null,null,null,{"$f":"IF(F34=0,0,SUM(F34*Insurance_and_Housing)/F35)","v":0},"/hr",null,{"$f":"IF(I34=0,0,SUM(I34*Insurance_and_Housing)/I35)","v":0},"/hr",null,{"$f":"IF(L34=0,0,SUM(L34*Insurance_and_Housing)/L35)","v":0},"/hr"]
[null,"Repair and maintenance",null,null,null,{"$f":"IF(F35=0,0,F43/F35)","v":0},"/hr",null,{"$f":"IF(I35=0,0,I43/I35)","v":0},"/hr",null,{"$f":"IF(L35=0,0,L43/L35)","v":0},"/hr"]
[null,"Margin on ownership and R&M",null,null,null,{"$f":"IF(F35=0,0,Margin_percentage*(F56+F53+F54+F55))","v":0},"/hr",null,{"$f":"IF(I35=0,0,Margin_percentage*(I56+I53+I54+I55))","v":0},"/hr",null,{"$f":"IF(L35=0,0,Margin_percentage*(L56+L53+L54+L55))","v":0},"/hr"]
[null,"Total hourly rental rate",null,null,null,{"$f":"SUM(F53:F57)","v":0},"/hr",null,{"$f":"SUM(I53:I57)","v":0},"/hr",null,{"$f":"SUM(L53:L57)","v":0},"/hr",null,null,null,null,null,"DO NOT DELETE",null,null,{"$f":"IF(OR(F46=\"n/a\",F47=\"n/a\"),\"n/a\",IF(ROUND((F46*5280*F47*F48)/43560,0)=0,\"n/a\",ROUND((F46*5280*F47*F48)/43560,0)))","v":"n/a"},"work rate"]
[null,"Total rental rate",null,null,null,{"$f":"IF($S$59=0,\"\",F58/$S$59)","v":""},{"$f":"IF(OR(F53=0,S59=0),\"\",VLOOKUP($F$28,DATA!$A$6:$AQ$196,42,FALSE))","v":""},null,{"$f":"IF($S$59=0,\"\",I58/$S$59)","v":""},{"$f":"IF(OR(I53=0,S59=0),\"\",G59)","v":""},null,{"$f":"IF($S$59=0,\"\",L58/$S$59)","v":""},{"$f":"IF(OR(L53=0,V59=0),\"\",G59)","v":""},null,null,null,null,null,{"$f":"MIN(F49,I49,L49)","v":0},null,null,null,null,null,{"$f":"IF(L49=\"n/a\",\"\",L58/L49)","v":""},{"$f":"IF(L49=\"n/a\",\"\",VLOOKUP($L$28,DATA!$A$6:$AQ$196,42,FALSE))","v":""}]
[]
[null,"Custom Rate Costs"]
[null,"Fuel",null,null,null,{"$f":"SUM(F41*Fuel_Price)","v":0},"/hr",null,{"$f":"SUM(I41*Fuel_Price)","v":0},"/hr",null,{"$f":"SUM(L41*Fuel_Price)","v":0},"/hr"]
[null,"Labour ",null,null,null,{"$f":"IF(F58=0,0,VLOOKUP($F$28,DATA!$A$6:$AQ$196,37,FALSE))","v":0},"/hr",null,{"$f":"IF(I58=0,0,VLOOKUP($I$28,DATA!$A$6:$AQ$196,37,FALSE))","v":0},"/hr",null,{"$f":"IF(L58=0,0,VLOOKUP($F$28,DATA!$A$6:$AQ$196,37,FALSE))","v":0},"/hr"]
[null,"Margin on fuel and labour",null,null,null,{"$f":"Margin_percentage*(F63+F62)","v":0},"/hr",null,{"$f":"Margin_percentage*(I63+I62)","v":0},"/hr",null,{"$f":"Margin_percentage*(L63+L62)","v":0},"/hr"]
[null,"Total hourly custom rate",null,null,null,{"$f":"SUM(F58,F62:F64)","v":0},"/hr",null,{"$f":"SUM(I58,I62:I64)","v":0},"/hr",null,{"$f":"SUM(L58,L62:L64)","v":0},"/hr"]
[null,"Total custom rate",null,null,null,{"$f":"IF(OR(F53=0,$S$59=0),\"\",SUM(F65/$S$59))","v":""},{"$f":"G59","v":""},null,{"$f":"IF(OR(I53=0,$S$59=0),\"\",SUM(I65/$S$59))","v":""},{"$f":"J59","v":""},null,{"$f":"IF(OR(L53=0,$S$59=0),\"\",SUM(L65/$S$59))","v":""},{"$f":"M59","v":""}]
[]
[null,"Total Cost of All Implements (Implement #1 + #2 + #3) "]
[null,"Total Rental Rate Costs"]
[null,"Total ownership",null,null,null,{"$f":"SUM(F53:F55,I53:I55,L53:L55)","v":0},"/hr"]
[null,"Total repair and maintenance",null,null,null,{"$f":"F56+I56+L56","v":0},"/hr"]
[null,"Total margin on ownership and R&M",null,null,null,{"$f":"F57+I57+L57","v":0},"/hr"]
[null,"Total hourly rental rate",null,null,null,{"$f":"F58+I58+L58","v":0},"/hr"]
[null,"Total rental rate",null,null,null,{"$f":"IF(S59=0,\"\",F73/S59)","v":""},{"$f":"G59","v":""}]
[]
[null,"Total Custom Rate Costs"]
[null,"Total fuel",null,null,null,{"$f":"F62+I62+L62","v":0},"/hr"]
[null,"Total Labour ",null,null,null,{"$f":"F63+I63+L63","v":0},"/hr"]
[null,"Total margin on fuel and labour",null,null,null,{"$f":"F64+I64+L64","v":0},"/hr"]
[null,"Total hourly custom rate",null,null,null,{"$f":"F65+I65+L65","v":0},"/hr"]
[null,"Total custom rate",null,null,null,{"$f":"IF(S59=0,\"\",SUM(F80/S59))","v":""},{"$f":"G74","v":""}]
[]
[]
[]
["Note: This budget is only a guide and is not intended as an in depth study of the cost of production of this industry. Interpretation and use of this information is the responsibility of the user. If you need help with a budget, contact a Farm Management Specialist."]
[]
[null,null,null,null,null,null,null,"                                         ",null,null,null,null,null,null,"January, 2024"]
["For more information:"]

{"sheet":"NAMES","index":1,"n_rows":84,"n_cols":13,"rows_kept":84,"cut":false,"hidden":true,"merged":[]}
["Main",null,"Tractors",null,"Harvesting Grain",null,"Harvesting Hay",null,"Seeding",null,"Soil Preparation",null,"Sprayers"]
["Category",null,"Two_Wheel_Drive",null,"Rotary_Combine",null,"Self_propelled_Forage_Harvester",null,"Air_Drills_with_Independent_Opener",null,"Cultivator_Field_with_tine_harrows",null,"High_Clearance_Sprayer"]
["(Select Category)",null,"100-119 hp",null,"Class 5 (less than 300 hp)",null,"Small (400-599 hp)",null,"Small, 25-45 FT (requires 400 hp)",null,"Small, 24-35 FT (requires 225+ hp)",null,"800 US gal, 90 FT boom"]
["Tractors",null,"120+ hp",null,"Class 6 (301-360 hp)",null,"Medium (600-799 hp)",null,"Medium, 46-65 FT (requires 500 hp)",null,"Medium, 36-49 FT (requires 400 hp)",null,"1000 US gal, 100 FT boom"]
["Harvesting_Grain",null,null,null,"Class 7 (361-420 hp)",null,"Large (800-899 hp)",null,"Large, 66-86 FT (requires 550+ hp)",null,"Large, 50-62 FT (requires 500 hp)",null,"1200 US gal, 120 FT boom"]
["Harvesting_Hay",null,null,null,"Class 8 (421-500 hp)",null,null,null,null,null,null,null,"1600 US gal, 130 FT boom"]
["Seeding",null,"Four_Wheel_Drive",null,"Class 9 (501-560 hp)",null,"SP_Forage_Harvester_Header",null,"Air_Hoe_Drill",null,"Cultivator_Heavy_Duty_with_tine_harrows"]
["Soil_Preparation",null,"Small (350-449 hp)",null,"Class 10 (561+ hp)",null,"Windrow Pickup (12-17 FT width)",null,"Small, 27-50 FT (requires 350 hp)",null,"Small, 23-40 FT (requires 400 hp)",null,"Miscellaneous"]
["Sprayers",null,"Medium (450-549 hp) ",null,null,null,"Corn (14-20 FT width)",null,"Large, 51-72 FT (requires 550+ hp)",null,"Medium, 41-50 FT (requires 500 hp)",null,"Post_Pounder"]
["Miscellaneous",null,"Large (550+ hp)",null,"Combine_Header",null,"Corn (21-30 FT width)",null,null,null,"Large, 51-62 FT (requires 550+ hp)",null,"3PT hitch (requires 55 hp)"]
[null,null,null,null,"Pickup (15 FT)",null,null,null,"Air_Disc_Drill",null,null,null,"Trailer mounted with engine"]
["Tractors",null,"Front_Wheel_Assist",null,"Rigid Draper (30 FT)",null,"Self_propelled_Mower_Conditioner",null,"Small, 30-49 FT (requires 450 hp)",null,"Harrow_Mid",null,"Skidsteer Mount (requires 55 hp)"]
["Two_Wheel_Drive",null,"Small (100-159 hp)",null,"Rigid Draper (35 FT)",null,"Disc Mower Conditioner (13-19 FT)",null,"Large, 50-70 FT (requires 550+ hp)",null,"60-90 FT (requires 400 hp)"]
["Four_Wheel_Drive",null,"Medium (160-224 hp)",null,"Rigid Draper (40 FT)",null,"Disc Mower Conditioner (30 FT)",null,null,null,null,null,"Vertical_Feed_Mixer"]
["Front_Wheel_Assist",null,"Large (225+ hp)",null,"Flex Auger (25 FT)",null,"Sickle Mower Conditioner (14-18 FT)",null,"Air_Seeder",null,"Harrow_Heavy",null,"280-360 cubic FT (requires 110 hp)"]
["Tracked",null,null,null,"Flex Auger (30 FT)",null,null,null,"Small, 25-40 FT (requires 350 hp)",null,"60-90 FT (requires 550+ hp)",null,"500-750 cubic FT (requires 160 hp)"]
[null,null,"Tracked",null,"Flex Auger (35 FT)",null,"Pull_Type_Mower_Conditioner",null,"Medium, 41-59 FT (requires 450 hp)",null,null,null,"830-1,150 cubic FT (requires 225+ hp)"]
["Harvesting_Grain",null,"Two Track (350-449 hp)",null,"Flex Draper (30 FT)",null,"Sickle (9-10 FT, requires 50 hp) ",null,"Large, 60-70 FT (requires 550+ hp)",null,"Harrow_Packer"]
["Rotary_Combine",null,"Two Track (450-570 hp)",null,"Flex Draper (35 FT)",null,"Sickle (14-16 FT, requires 100 hp) ",null,null,null,"25-62 FT (requires 175 hp)",null,"Grinder_Mixer"]
["Combine_Header",null,"Four Track (400-474 hp)",null,"Flex Draper (40 FT)",null,"Disc (7-9 FT side pull, requires 60 hp) ",null,"Row_Crop_Planter",null,null,null,"360-440 cubic FT (requires 120 hp)"]
["Self_propelled_Swather",null,"Four Track (475-549 hp)",null,"Flex Draper (45 FT)",null,"Disc (14 FT, requires 90 hp) ",null,"12 row planter (requires 150 hp)",null,"Vertical_Tillage_Tools_Compact",null,"550-750 cubic FT (requires 200 hp)"]
["Grain_Cart",null,"Four Track (550-650 hp)",null,"Flex Draper (50 FT)",null,"Disc (16-18 FT, requires 100 hp) ",null,"16 row planter (requires 180 hp)",null,"Small, 10-30 FT (requires 400 hp)"]
["Powered_Auger",null,null,null,"Corn (6 row, 30\" spacing)",null,null,null,"24 row planter (requires 230 hp)",null,"Large, 31-50 FT (requires 550+ hp)",null,"Feed_Mixer"]
["PTO_Grain_Auger",null,null,null,"Corn (8 row, 30\" spacing)",null,null,null,"12/24 split row planter (requires 210 hp)",null,null,null,"Two 6 FT bale, 40 bu grain (requires 100 hp)"]
["PTO_Grain_Conveyor",null,null,null,"Corn (12 row folding, 30\" spacing)",null,"Baler_Large_Round",null,"16/32 split row planter (requires 250 hp)",null,"Vertical_Tillage_Tools_Heavy_Duty"]
["Swath_Roller",null,null,null,"Corn (16-18 row folding , 30\" spacing)",null,"4x5 FT bales (requires 80 hp)",null,null,null,"Small, 10-25 FT (requires 500 hp)",null,"Bale_Processor"]
["Grain_Bag_Loader",null,null,null,null,null,"5x5 FT bales (requires 135 hp)",null,null,null,"Large, 26-40 FT (requires 550+ hp)",null,"Two 6 FT round bale (requires 155 hp)"]
["Grain_Bag_Extractor",null,null,null,"Self_propelled_Swather",null,"5x6 FT bales (requires 135 hp)",null,null,null,null,null,"Six  6 FT round bale (requires 175 hp)"]
["Grain_Dryer",null,null,null,"25 FT",null,"5x5 FT silage, net wrap bales (requires 135 hp)",null,null,null,"Land_Roller"]
["Grain_Vac",null,null,null,"30 FT",null,"5x6 FT silage, net wrap bales (requires 135 hp)",null,null,null,"20 FT (fixed) (requires 100 hp)",null,"Manure_Spreader_solid"]
[null,null,null,null,"35 FT",null,null,null,null,null,"40-50 FT (3 sections) (requires 225+ hp)",null,"250-299 cubic FT level, chain unload (requires 120 hp)"]
["Harvesting_Hay",null,null,null,"40 FT",null,"Baler_Large_Square",null,null,null,"55-75 FT (5 sections) (requires 400 hp)",null,"300-399 cubic FT level, chain unload (requires 125 hp)"]
["Self_propelled_Forage_Harvester",null,null,null,null,null,"Small, 35x31x108 in. (requires 145 hp)",null,null,null,null,null,"400-500 cubic FT level, chain unload (requires 150 hp)"]
["SP_Forage_Harvester_Header",null,null,null,"Grain_Cart",null,"Medium, 35x47x108 in. (requires 145 hp)",null,null,null,"Land_Scraper",null,"300-399 cubic FT level, side discharge (requires 150 hp)"]
["Pull_Type_Forage_Harvester",null,null,null,"Small (1,000 bu, requires 350 hp)",null,"Large, 50x47x108 in. (requires 180 hp)",null,null,null,"10.0-15.0 CU. yard (requires 400 hp)",null,"400-500 cubic FT level, side discharge (requires 180 hp)"]
["PT_Forage_Harvester_Header",null,null,null,"Medium (1,400 bu, requires 450 hp)",null,null,null,null,null,"15.0+ CU. yard (requires 550 hp)",null,"500+  cubic FT level, side discharge (requires 200 hp)"]
["Self_propelled_Mower_Conditioner",null,null,null,"Large (2,000 bu, requires 550+ hp)",null,"Baler_Small_Square",null,null,null,"Pull Dozer 15.0-20.0 CU. yard (requires 400 hp)",null,"250-300 cubic FT, hyd. push, vert. beaters (requires 150 hp)"]
["Pull_Type_Mower_Conditioner",null,null,null,null,null,"14x18x52 in. bales (requires 50 hp)",null,null,null,"Pull Dozer 21.0+ CU. yard (requires 550 hp)",null,"400-500 cubic FT, hyd. push, vert. beaters (requires 200 hp)"]
["Hay_Rakes",null,null,null,"Powered_Auger",null,"16x18x52 in. bales (requires 50 hp)",null,null,null,"Rotary Ditcher (requires 400 hp)"]
["Baler_Large_Round",null,null,null,"8 in. (30-39 FT, 20 hp engine)",null,null,null,null,null,null,null,"Front_End_Loader"]
["Baler_Large_Square",null,null,null,"8 in. (40-49 FT, 20 hp engine)",null,"Pull_Type_Bale_Mover_Self_load_unload",null,null,null,"Discs_Heavy_Offset",null,"For 100-159 hp tractor"]
["Baler_Small_Square",null,null,null,"8 in. (50-59 FT, 25 hp engine)",null,"Round Bale 7-12 bale (requires 120 hp)",null,null,null,"Small, 10-12 FT (requires 105 hp)",null,"For 160-224 hp tractor"]
["Pull_Type_Bale_Mover_Self_load_unload",null,null,null,"10 in. (40-49 FT, 35 hp engine)",null,"Round Bale 12-18 bale (requires 180 hp)",null,null,null,"Medium, 14-16 FT (requires 150 hp)"]
["Self_propelled_Bale_Mover",null,null,null,"10 in. (50-59 FT, 38 hp engine)",null,"Large Square 4-6 bale (requires 120 hp)",null,null,null,"Large, 17-20 FT (requires 180 hp)",null,"Livestock_Trailer"]
[null,null,null,null,"12-13 in. u trough (39-40 FT, 38-50 hp engine)",null,"Large Square 6-12 bale (requires 180 hp)",null,null,null,null,null,"20 FT gooseneck"]
["Seeding",null,null,null,null,null,"Large Square 12-20 bale (requires 220 hp)",null,null,null,"Discs_Heavy_Tandem",null,"24 FT gooseneck"]
["Air_Drills_with_Independent_Opener",null,null,null,"PTO_Grain_Auger",null,null,null,null,null,"Small, 24-30 FT (requires 180 hp)"]
["Air_Hoe_Drill",null,null,null,"8 in. (30-69 FT, 2,700-3,200 bu/hr, requires 50 hp)",null,"Self_propelled_Bale_Mover",null,null,null,"Medium, 31-35 FT (requires 210 hp)",null,"Snowblower"]
["Air_Disc_Drill",null,null,null,"10 in. (40-89 FT, 5,400 bu/hr, requires 75 hp)",null,"Self propelled Small Square Bale Wagon",null,null,null,"Large, 36-42 FT (requires 250 hp)",null,"Rear mount, 80-89 in. (requires 70 hp)"]
["Air_Seeder",null,null,null,"13 in. (70-120 FT, 9,700 bu/hr, requires 100 hp)",null,null,null,null,null,null,null,"Rear mount, 96 in. (requires 110 hp)"]
["Row_Crop_Planter",null,null,null,"16 in. (80-100 FT, 21,000 bu/hr, requires 200 hp)",null,"Hay_Rakes",null,null,null,"Anhydrous_Ammonia_Applicator_Add_On",null,"Rear mount, 108 in. (requires 130 hp)"]
[null,null,null,null,"16 in. (100+ FT, 21,000 bu/hr, requires 200 hp)",null,"16-20 FT bar (requires 50 hp)",null,null,null,"30-60 FT (less tillage tool, nurse tank & trailer)"]
["Soil_Preparation",null,null,null,null,null,"21-30 FT wheel (requires 50 hp)",null,null,null,null,null,"Grain_Truck"]
["Cultivator_Field_with_tine_harrows",null,null,null,"Grain_Vac",null,"31-40 FT wheel (requires 50 hp)",null,null,null,"Liquid_Fertilizer_Applicator_Add_On",null,"Tandem"]
["Cultivator_Heavy_Duty_with_tine_harrows",null,null,null,"2,400-5,000 bu/hr (requires 70 hp)",null,null,null,null,null,"25-40 FT (1600-1800 gal. tank & cart, less tillage tool)",null,"Truck and 40FT Straight Trailer"]
["Harrow_Mid",null,null,null,"6,000-10,000 bu/hr (requires 120 hp)",null,"Pull_Type_Forage_Harvester",null,null,null,"40-60 FT (2400-3200 gal. tank & cart, less tillage tool)"]
["Harrow_Heavy",null,null,null,null,null,"For up to 150 hp tractor",null,null,null,"60-75 FT (4300 gal. tank & cart, less tillage tool)"]
["Harrow_Packer",null,null,null,"PTO_Grain_Conveyor",null,"For 151 to 250 hp tractor"]
["Vertical_Tillage_Tools_Compact",null,null,null,"20-24 in. (90 FT, non swing, requires 100 hp)",null,"For up to 300 hp tractor",null,null,null,"Granular_Fertilizer_Applicator"]
["Vertical_Tillage_Tools_Heavy_Duty",null,null,null,"20-24 in. (100+ FT, swing away, requires 130 hp)",null,null,null,null,null,"6-10 ton, spin 40 FT (requires 100hp)"]
["Land_Roller",null,null,null,null,null,"PT_Forage_Harvester_Header",null,null,null,"10-12 ton, boom 60 FT (requires 225+hp)"]
["Discs_Heavy_Offset",null,null,null,"Swath_Roller",null,"Windrow Pickup (70-79 in. width)"]
["Discs_Heavy_Tandem",null,null,null,"Drawn (10 FT)",null,"Windrow Pickup (80-96 in. width)",null,null,null,"Rock_Windower_Rake"]
["Anhydrous_Ammonia_Applicator_Add_On",null,null,null,"Attached (10 FT)",null,"Corn (2 row)",null,null,null,"12-14 FT (requires 50 hp)"]
["Liquid_Fertilizer_Applicator_Add_On",null,null,null,null,null,"Corn (3 row)"]
["Granular_Fertilizer_Applicator",null,null,null,"Grain_Bag_Loader",null,null,null,null,null,"Rock_Picker"]
["Rock_Windower_Rake",null,null,null,"Bagger (10 FT, requires 60 hp)",null,null,null,null,null,"1.5-2.5 CU. yard (requires 75 hp)"]
["Rock_Picker",null,null,null,"Bagger (12 FT, requires 125 hp)",null,null,null,null,null,"3.0-3.3 CU. yard (requires 85 hp)"]
["Land_Scraper"]
[null,null,null,null,"Grain_Bag_Extractor"]
["Sprayers",null,null,null,"Unloader (10 FT, requires 60 hp)"]
["High_Clearance_Sprayer",null,null,null,"Unloader (12 FT, requires 100 hp)"]
[]
["Miscellaneous",null,null,null,"Grain_Dryer"]
["Post_Pounder",null,null,null,"275-370 bu/hr"]
["Front_End_Loader",null,null,null,"420-610 bu/hr"]
["Livestock_Trailer",null,null,null,"710-910 bu/hr"]
["Vertical_Feed_Mixer",null,null,null,"1060-1180 bu/hr"]
["Grinder_Mixer",null,null,null,"1440-2380 bu/hr"]
["Feed_Mixer"]
["Bale_Processor"]
["Snowblower"]
["Grain_Truck"]
["Manure_Spreader_solid"]

{"sheet":"DATA","index":2,"n_rows":199,"n_cols":55,"rows_kept":199,"cut":false,"hidden":true,"merged":[[2,39,4,39],[2,23,4,23],[2,24,4,24],[2,25,4,25],[2,26,4,26],[2,31,4,31],[3,8,3,12],[3,13,3,17],[3,18,3,22],[1,23,1,24],[2,29,4,29],[3,1,4,1],[3,2,4,2],[3,3,4,3],[3,6,4,6],[3,7,4,7],[3,4,4,4],[3,5,4,5],[2,47,4,47],[2,48,4,48],[2,27,4,27],[2,28,4,28],[2,43,4,43],[2,32,4,32],[2,33,4,33],[2,34,4,34],[2,40,4,40],[2,38,4,38],[2,42,4,42],[2,41,4,41],[2,30,4,30],[2,35,4,35],[2,36,4,36],[2,37,4,37]]}
[1,2,3,4,5,6,7,8,9,10,11,12,13,14,15,16,17,18,19,20,21,22,23,24,25,26,27,28,29,30,31,32,33,34,35,36,37,38,39,40,41,42,43,null,null,null,null,26]
[null,null,null,">$50,000; round nearest 5000 \n=ROUND(G6/5000,0)*5000",null,"<$10,000 round to nearest 500",null,null,null,null,null,null,null,null,null,null,null,null,null,null,null,null,null,"Fraction_dep_over_optimal_life",null,0.66666666665999996,null,null,null,null,null,null,null,null,null,null,null,null,null,null,null,null,null,null,null,null,null,"OLD'",0.05]
[null,null,null,"$10,000-$50,000 round to nearest 1000\n =ROUND(F25,-3)",null,null,"* enter prices here*",null,null,null,null,null,null,null,null,null,null,null,null,null,null,null,null,"Optimal Life (years)","Annual Hours of Use","Repair Rate (%)","Litre / Hour","Speed                     (MPH)","Defined Width of Implement                     (ft)","Work Rate","Unit","Ownership Cost\n($/hr)","Repair\n& Maint.\n(R&M)\nCost\n($/hr)","Margin on Ownership and R&M\n($/hr)","Rental Rate    ($/hr)","Fuel Cost           ($/hr)","Labour Cost\n($/hr)","Margin on Labour & Fuel\n($/hr)","Power Unit Cost\n($/hr)","Custom Rate                     ($/hr)","Custom Rate                     ($/acre)","Unit","Rental Rate                     ($/acre)","Work Rate",null,null,null,"Repair Rate (%)","Repair Rate (%)"]
["white box = all formula references to side boxes are removed, pulling from data tab","Category","Type","Size","Machine Size","Rounded Ave Discountd MSRP","Ave Discountd MSRP","Average New Selling Price","Dealer/Model 1",null,null,null,null,"Dealer/Model 2",null,null,null,null,"Dealer/Model 3"]
[null,null,null,null,null,null,null,null,"Make","Model ","MSRP","Discounted MSRP","New Selling Price","Make","Model ","MSRP","Discounted MSRP","New Selling Price","Make","Model ","MSRP","Discounted MSRP","New Selling Price"]
[{"$f":"B6&\" \"&C6&\" \"&D6","v":"Tractors Two_Wheel_Drive 100-119 hp"},"Tractors","Two_Wheel_Drive","100-119 hp",null,155000,150268,{"$f":"IFERROR(AVERAGE(M6,R6,W6),\"\")","v":""},"John Deere","6110R Cab",null,null,null,"Case IH","Farmall 110A",null,null,null,"John Deere","5115M Cab",null,null,null,20,300,2.31,24,null,null,null,null,{"$f":"(F6*Fraction_dep_over_optimal_life/X6/Y6)+IF(Machinery_Financed_percentage=0,0,(-CUMIPMT(Interest_Rate/2,Payback_loan_period_years*2,F6*Machinery_Financed_percentage,1,Payback_loan_period_years*2,0)/X6/Y6))+((F6*(1-Machinery_Financed_percentage)*(1+Opportunity_Rate/12)^(Opp_inv_period_years*12)-(F6*(1-Machinery_Financed_percentage)))/X6/Y6)+(Insurance_and_Housing*F6/Y6)","v":28.304342000795952},{"$f":"Z6/100*F6/Y6","v":11.935},{"$f":"Margin_percentage*(AF6+AG6)","v":6.0359013001193924},{"$f":"IF(AF6+AG6+AH6<10,ROUND((AF6+AG6+AH6)/0.25,0)*0.25,ROUND(AF6+AG6+AH6,0))","v":46},{"$f":"AA6*Fuel_Price","v":33.599999999999994},{"$f":"Labour","v":27},{"$f":"Margin_percentage*(AJ6+AK6)","v":9.0899999999999981},null,{"$f":"IF(AI6+AJ6+AK6+AL6+AM6<10,ROUND((AI6+AJ6+AK6+AL6+AM6)/0.25,0)*0.25,ROUND(AI6+AJ6+AK6+AL6+AM6,0))","v":116},null,"/acre",null,null,null,null,null,2.2000000000000002,{"$f":"ROUND((AV6*$AW$2)+AV6,2)","v":2.31}]
[{"$f":"B7&\" \"&C7&\" \"&D7","v":"Tractors Two_Wheel_Drive 120+ hp"},"Tractors","Two_Wheel_Drive","120+ hp",null,{"$f":"ROUNDUP(G7/5000,0)*5000","v":170000},165626,"","John Deere","6145R",null,null,null,"Case IH","Farmall 130A",null,null,null,"John Deere","5125R",null,null,null,20,300,2.31,28,null,null,null,null,31.043471871840726,{"$f":"Z7/100*F7/Y7","v":13.09},6.6200207807761089,{"$f":"IF(AF7+AG7+AH7<10,ROUND((AF7+AG7+AH7)/0.25,0)*0.25,ROUND(AF7+AG7+AH7,0))","v":51},39.199999999999996,27,9.9299999999999979,null,{"$f":"IF(AI7+AJ7+AK7+AL7+AM7<10,ROUND((AI7+AJ7+AK7+AL7+AM7)/0.25,0)*0.25,ROUND(AI7+AJ7+AK7+AL7+AM7,0))","v":127},null,"/acre",null,null,null,null,null,2.2000000000000002,{"$f":"ROUND((AV7*$AW$2)+AV7,2)","v":2.31}]
["Tractors Front_Wheel_Assist Small (100-159 hp)","Tractors","Front_Wheel_Assist","Small (100-159 hp)","(100-159 hp)",{"$f":"ROUNDUP(G8/5000,0)*5000","v":250000},249364,"","John Deere","6155R",null,null,null,"Case IH","Maxxum 150 CVX",null,null,null,"New Holland","T7.190",null,null,null,15,450,2.73,26,null,null,null,null,38.727849941404003,15.166666666666666,8.0841774912105997,62,36.4,27,9.51,null,135,null,"/acre",null,null,null,null,null,2.6,2.73]
["Tractors Front_Wheel_Assist Medium (160-224 hp)","Tractors","Front_Wheel_Assist","Medium (160-224 hp)","(160-224 hp)",{"$f":"ROUNDUP(G9/5000,0)*5000","v":350000},350000,"","John Deere","7210R",null,null,null,"Case IH","Magnum 220",null,null,null,"New Holland","T7.210 T4B",null,null,null,15,450,2.73,36,null,null,null,null,54.218989917965594,21.233333333333334,11.317848487694841,87,50.4,27,11.610000000000001,null,176,null,"/acre",null,null,null,null,null,2.6,2.73]
["Tractors Front_Wheel_Assist Large (225+ hp)","Tractors","Front_Wheel_Assist","Large (225+ hp)","(225+ hp)",{"$f":"ROUNDUP(G10/25000,0)*25000","v":425000},425000,"","John Deere","8320R",null,null,null,"Case IH","Magnum 310",null,null,null,"New Holland","T7.315",null,null,null,15,450,2.73,48,null,null,null,null,65.83734490038681,25.783333333333335,{"$f":"Margin_percentage*(AF10+AG10)","v":13.743101735058021},105,67.199999999999989,27,14.129999999999997,null,213,null,"/acre",null,null,null,null,null,2.6,2.73]
["Tractors Four_Wheel_Drive Small (350-449 hp)","Tractors","Four_Wheel_Drive","Small (350-449 hp)","(350-449 hp)",600000,600000,"","John Deere","9370R",null,null,null,"Case IH","Steiger 370",null,null,null,"New Holland","T8.380",null,null,null,15,450,2.63,63,null,null,null,null,92.946839859369589,35.06666666666667,19.202025978905436,147,88.199999999999989,27,17.279999999999998,null,279,null,"/acre",null,null,null,null,null,2.5,2.63]
[{"$f":"B12&\" \"&C12&\" \"&D12","v":"Tractors Four_Wheel_Drive Medium (450-549 hp) "},"Tractors","Four_Wheel_Drive","Medium (450-549 hp) ","(450-549 hp)",675000,675000,"","John Deere","9470R",null,null,null,"Case IH","Steiger 470",null,null,null,null,null,null,null,null,15,450,2.63,76,null,null,null,null,104.5651948417908,39.450000000000003,21.602279226268617,166,106.39999999999999,27,20.009999999999994,null,319,null,"/acre",null,null,null,null,null,2.5,2.63]
["Tractors Four_Wheel_Drive Large (550+ hp)","Tractors","Four_Wheel_Drive","Large (550+ hp)","(550+ hp)",725000,715477,"","John Deere","9570R",null,null,null,"Case IH","Steiger 580",null,null,null,"New Holland","T9.565HD",null,null,null,15,450,2.63,88,null,null,null,null,112.31076483007162,42.37222222222222,23.202448057844077,178,123.19999999999999,27,22.529999999999998,null,351,null,"/acre",null,null,null,null,null,2.5,2.63]
["Tractors Tracked Two Track (350-449 hp)","Tractors","Tracked","Two Track (350-449 hp)",null,575000,562087,"","John Deere","8320RT",null,null,null,"Case IH","Magnum 310 Rowtrac",null,null,null,"John Deere","8345RT",null,null,null,15,450,3.36,63,null,null,null,null,89.074054865229186,42.93333333333333,19.801108229784379,152,88.199999999999989,27,17.279999999999998,null,284,null,"/acre",null,null,null,null,null,3.2,3.36]
["Tractors Tracked Two Track (450-570 hp)","Tractors","Tracked","Two Track (450-570 hp)",null,700000,692277,"","John Deere","8370RT",null,null,null,"Case IH","Steiger 420 Rowtrac",null,null,null,"New Holland","T8.410 SmartTrax",null,null,null,15,450,3.36,80,null,null,null,null,108.43797983593119,52.266666666666666,24.105696975389677,185,112,27,20.849999999999998,null,345,null,"/acre",null,null,null,null,null,3.2,3.36]
["Tractors Tracked Four Track (400-474 hp)","Tractors","Tracked","Four Track (400-474 hp)",null,{"$f":"ROUNDUP(G16/25000,0)*25000","v":700000},700000,"","John Deere","9470RT",null,null,null,"Case IH","Steiger 470 Rowtrac",null,null,null,"New Holland","T9.530 SmartTrax",null,null,null,15,450,3.36,100,null,null,null,null,108.43797983593119,52.266666666666666,24.105696975389677,185,140,27,25.05,null,377,null,"/acre",null,null,null,null,null,3.2,3.36]
["Tractors Tracked Four Track (475-549 hp)","Tractors","Tracked","Four Track (475-549 hp)",null,775000,753218,"","John Deere","9570RT",null,null,null,"Case IH","Steiger 580 Quadtrac",null,null,null,"New Holland","T9.565 SmartTrax",null,null,null,15,450,3.36,110,null,null,null,null,120.05633481835241,{"$f":"Z17/100*F17/Y17","v":57.866666666666667},26.688450222752863,205,154,27,27.15,null,413,null,"/acre",null,null,null,null,null,3.2,3.36]
["Tractors Tracked Four Track (550-650 hp)","Tractors","Tracked","Four Track (550-650 hp)",null,850000,843460,"","John Deere","9620RX",null,null,null,"Case IH","Steiger 620 Quadtrac",null,null,null,"New Holland","T9.645 SmartTrax",null,null,null,15,450,3.36,115,null,null,null,null,131.67468980077362,63.466666666666669,29.271203470116042,224,161,27,28.2,null,440,null,"/acre",null,null,null,null,null,3.2,3.36]
["Harvesting_Grain Rotary_Combine Class 5 (less than 300 hp)","Harvesting_Grain","Rotary_Combine","Class 5 (less than 300 hp)","(≤ 300 hp)",{"$f":"ROUNDUP(G19/50000,0)*50000","v":500000},500000,{"$f":"IFERROR(AVERAGE(L19,Q19,V19),\"\")","v":""},"John Deere","S650",null,null,null,"Case IH",5140,null,null,null,null,null,null,null,null,12,250,2.63,43,3.5,25,{"$f":"ROUND((AB19*5280*AC19*Field_efficiency)/43560,0)","v":8}," (acre/hr)",169.275324736318,52.6,33.2812987104477,{"$f":"IF(AF19+AG19+AH19<10,ROUND((AF19+AG19+AH19)/0.25,0)*0.25,ROUND(AF19+AG19+AH19,0))","v":255},60.199999999999996,27,13.079999999999998,null,355,{"$f":"IF(AN19/AD19<10,ROUND((AN19/AD19)/0.25,0)*0.25,ROUND(AN19/AD19,0))","v":44},"/acre",null,null,null,null,null,2.5,2.63,null,{"$f":"(F19*Fraction_dep_over_optimal_life/X19/Y19)+IF(Machinery_Financed_percentage=0,0,(-CUMIPMT(Interest_Rate/2,Payback_loan_period_years*2,F19*Machinery_Financed_percentage,1,Payback_loan_period_years*2,0)/X19/Y19))+((F19*(1-Machinery_Financed_percentage)*(1+Opportunity_Rate/12)^(Opp_inv_period_years*12)-(F19*(1-Machinery_Financed_percentage)))/X19/Y19)+(Insurance_and_Housing*F19/Y19)","v":169.275324736318},{"$f":"(F19*Fraction_dep_over_optimal_life/X19/Y19)","v":111.11111111},{"$f":"IF(Machinery_Financed_percentage=0,0,(-CUMIPMT(Interest_Rate/2,Payback_loan_period_years*2,F19*Machinery_Financed_percentage,1,Payback_loan_period_years*2,0)/X19/Y19))+((F19*(1-Machinery_Financed_percentage)*(1+Opportunity_Rate/12)^(Opp_inv_period_years*12)-(F19*(1-Machinery_Financed_percentage)))/X19/Y19)","v":38.164213626318016},{"$f":"(Insurance_and_Housing*F19/Y19)","v":20},{"$f":"SUM(AZ19:BB19)","v":169.275324736318}]
["Harvesting_Grain Rotary_Combine Class 6 (301-360 hp)","Harvesting_Grain","Rotary_Combine","Class 6 (301-360 hp)","(301-360 hp)",550000,547558,{"$f":"IFERROR(AVERAGE(L20,Q20,V20),\"\")","v":""},"John Deere","S760",null,null,null,"New Holland","CR6.90",null,null,null,null,null,null,null,null,12,250,2.63,51,4,25,10," (acre/hr)",186.2028572099498,57.86,36.609428581492473,281,71.399999999999991,27,14.759999999999998,null,394,{"$f":"IF(AN20/AD20<10,ROUND((AN20/AD20)/0.25,0)*0.25,ROUND(AN20/AD20,0))","v":39},"/acre",null,null,null,null,null,2.5,2.63]
["Harvesting_Grain Rotary_Combine Class 7 (361-420 hp)","Harvesting_Grain","Rotary_Combine","Class 7 (361-420 hp)","(361-420 hp)",650000,609271,"","John Deere","S770",null,null,null,"New Holland","CR7.90",null,null,null,null,null,null,null,null,12,250,2.63,55,4,30,12," (acre/hr)",220.05792215721337,68.38,43.265688323582005,332,77,27,15.6,null,452,38,"/acre",null,null,null,null,null,2.5,2.63]
["Harvesting_Grain Rotary_Combine Class 8 (421-500 hp)","Harvesting_Grain","Rotary_Combine","Class 8 (421-500 hp)","(421-500 hp)",750000,708537,{"$f":"IFERROR(AVERAGE(L22,Q22,V22),\"\")","v":""},"John Deere","S780",null,null,null,"New Holland","CR8.90",null,null,null,null,null,null,null,null,12,250,2.63,71,4.5,35,15," (acre/hr)",253.91298710447703,78.900000000000006,49.92194806567155,383,99.399999999999991,27,18.959999999999997,null,528,35,"/acre",null,null,null,null,null,2.5,2.63]
["Harvesting_Grain Rotary_Combine Class 9 (501-560 hp)","Harvesting_Grain","Rotary_Combine","Class 9 (501-560 hp)","(501-560 hp)",850000,805534,{"$f":"IFERROR(AVERAGE(L23,Q23,V23),\"\")","v":""},"John Deere","S790",null,null,null,"New Holland","CR9.90",null,null,null,null,null,null,null,null,12,250,2.63,82,4.5,40,17," (acre/hr)",287.7680520517406,89.42,56.578207807761089,434,114.8,27,21.27,null,597,35,"/acre",null,null,null,null,null,2.5,2.63]
["Harvesting_Grain Rotary_Combine Class 10 (561+ hp)","Harvesting_Grain","Rotary_Combine","Class 10 (561+ hp)","(561+ hp)",950000,945092,{"$f":"IFERROR(AVERAGE(L24,Q24,V24),\"\")","v":""},"Claas",780,null,null,null,"New Holland","CR10.90Z",null,null,null,null,null,null,null,null,12,250,2.63,90,5.5,40,21," (acre/hr)",321.6231169990042,99.94,63.234467549850628,485,125.99999999999999,27,22.95,null,661,31,"/acre",null,null,null,null,null,2.5,2.63]
["Harvesting_Grain Combine_Header Pickup (15 FT)","Harvesting_Grain","Combine_Header","Pickup (15 FT)","15 FT",{"$f":"ROUND(G25,-3)","v":39000},38770,"","New Holland","790CP-12",null,null,null,"Case IH","3016-12",null,null,null,null,null,null,null,null,20,250,1.58,null,null,null,null,null,8.5460851976596821,2.4648000000000003,1.6516327796489523,13,null,null,null,null,null,null,"/acre",null,null,null,null,null,1.5,1.58]
["Harvesting_Grain Combine_Header Rigid Draper (30 FT)","Harvesting_Grain","Combine_Header","Rigid Draper (30 FT)","30 FT",{"$f":"ROUNDUP(G26/5000,0)*5000","v":110000},109122,"","John Deere","615P",null,null,null,"Case IH","3016-15",null,null,null,"New Holland","790CP-15",null,null,null,20,250,2.1,null,null,null,null,null,24.104342865193978,9.24,5.0016514297790966,38,null,null,null,null,null,null,"/acre",null,null,null,null,null,1.5,1.58]
["Harvesting_Grain Combine_Header Rigid Draper (35 FT)","Harvesting_Grain","Combine_Header","Rigid Draper (35 FT)","35 FT",{"$f":"ROUNDUP(G27/5000,0)*5000","v":125000},123234,"","New Holland","720CG-24",null,null,null,"Case IH","2030-24",null,null,null,"New Holland","840CD-25",null,null,null,20,250,2.1,null,null,null,null,null,27.391298710447703,10.5,5.6836948065671544,44,null,null,null,null,null,null,"/acre",null,null,null,null,null,2,2.1]
["Harvesting_Grain Combine_Header Rigid Draper (40 FT)","Harvesting_Grain","Combine_Header","Rigid Draper (40 FT)","40 FT",{"$f":"ROUNDUP(G28/5000,0)*5000","v":140000},139163,"","New Holland","720CG-30",null,null,null,"Case IH","2030-30",null,null,null,"New Holland","840CD-35",null,null,null,20,250,2.1,null,null,null,null,null,30.678254555701422,11.76,6.3657381833552131,49,null,null,null,null,null,null,"/acre",null,null,null,null,null,2,2.1]
["Harvesting_Grain Combine_Header Flex Auger (25 FT)","Harvesting_Grain","Combine_Header","Flex Auger (25 FT)","25 FT",{"$f":"ROUNDUP(G29/5000,0)*5000","v":60000},55662,"","John Deere","620F",null,null,null,"New Holland","740CF-20F",null,null,null,"AGCO Gleaner","8200-20",null,null,null,15,250,2.63,null,null,null,null,null,16.730431174686526,6.3120000000000003,3.4563646762029792,26,null,null,null,null,null,null,"/acre",null,null,null,null,null,2.5,2.63]
["Harvesting_Grain Combine_Header Flex Auger (30 FT)","Harvesting_Grain","Combine_Header","Flex Auger (30 FT)","30 FT",70000,67059,"","John Deere","625F",null,null,null,"New Holland","740CF-25F",null,null,null,"AGCO Gleaner","8200-25",null,null,null,15,250,2.63,null,null,null,null,null,19.518836370467614,7.3639999999999999,4.0324254555701424,31,null,null,null,null,null,null,"/acre",null,null,null,null,null,2.5,2.63]
["Harvesting_Grain Combine_Header Flex Auger (35 FT)","Harvesting_Grain","Combine_Header","Flex Auger (35 FT)","35 FT",80000,77706,"","John Deere","630F",null,null,null,"New Holland","740CF-30F",null,null,null,"AGCO Gleaner","8200-30",null,null,null,15,250,2.63,null,null,null,null,null,{"$f":"(F31*Fraction_dep_over_optimal_life/X31/Y31)+IF(Machinery_Financed_percentage=0,0,(-CUMIPMT(Interest_Rate/2,Payback_loan_period_years*2,F31*Machinery_Financed_percentage,1,Payback_loan_period_years*2,0)/X31/Y31))+((F31*(1-Machinery_Financed_percentage)*(1+Opportunity_Rate/12)^(Opp_inv_period_years*12)-(F31*(1-Machinery_Financed_percentage)))/X31/Y31)+(Insurance_and_Housing*F31/Y31)","v":22.307241566248699},{"$f":"Z31/100*F31/Y31","v":8.4160000000000004},4.6084862349373044,35,null,null,null,null,null,null,"/acre",null,null,null,null,null,2.5,2.63]
["Harvesting_Grain Combine_Header Flex Draper (30 FT)","Harvesting_Grain","Combine_Header","Flex Draper (30 FT)","30 FT",125000,123661,"","John Deere","635F",null,null,null,"New Holland","740CF-35F",null,null,null,"AGCO Gleaner","8200-35",null,null,null,15,250,2.94,null,null,null,null,null,34.8550649472636,14.7,7.4332597420895397,57,null,null,null,null,null,null,"/acre",null,null,null,null,null,2.5,2.63]
["Harvesting_Grain Combine_Header Flex Draper (35 FT)","Harvesting_Grain","Combine_Header","Flex Draper (35 FT)","35 FT",140000,139657,"","John Deere","725D",null,null,null,"Case IH","3152-25",null,null,null,"AGCO Gleaner","9255-25",null,null,null,15,250,2.94,null,null,null,null,null,39.037672740935228,16.463999999999999,8.3252509111402837,64,null,null,null,null,null,null,"/acre",null,null,null,null,null,2.5,2.63]
["Harvesting_Grain Combine_Header Flex Draper (40 FT)","Harvesting_Grain","Combine_Header","Flex Draper (40 FT)","40 FT",150000,147851,"","John Deere","730D",null,null,null,"Case IH","3152-30",null,null,null,"AGCO Gleaner","9255-30",null,null,null,15,250,2.94,null,null,null,null,null,41.826077936716317,17.64,8.9199116905074476,68,null,null,null,null,null,null,"/acre",null,null,null,null,null,2.5,2.63]
["Harvesting_Grain Combine_Header Flex Draper (45 FT)","Harvesting_Grain","Combine_Header","Flex Draper (45 FT)","45 FT",160000,158752,"","John Deere","735D",null,null,null,"Case IH","3152-35",null,null,null,"AGCO Gleaner","9255-35",null,null,null,15,250,2.94,null,null,null,null,null,44.614483132497398,18.815999999999999,9.5145724698746097,73,null,null,null,null,null,null,"/acre",null,null,null,null,null,2.5,2.63]
["Harvesting_Grain Combine_Header Flex Draper (50 FT)","Harvesting_Grain","Combine_Header","Flex Draper (50 FT)","50 FT",185000,182854,"","John Deere","740D",null,null,null,"Case IH","3152-40",null,null,null,"AGCO Gleaner","9255-40",null,null,null,15,250,2.94,null,null,null,null,null,51.585496121950122,21.756,11.001224418292518,84,null,null,null,null,null,null,"/acre",null,null,null,null,null,2.5,2.63]
["Harvesting_Grain Combine_Header Corn (6 row, 30\" spacing)","Harvesting_Grain","Combine_Header","Corn (6 row, 30\" spacing)","6 row\n30\" spacing",85000,84151,"","John Deere","706C",null,null,null,"AGCO Gleaner",3206,null,null,null,"New Holland","980CR-6R",null,null,null,15,100,2.94,null,null,null,null,null,59.253610410348109,24.99,12.636541561552216,97,null,null,null,null,null,null,"/acre",null,null,null,null,null,2.8,2.94]
["Harvesting_Grain Combine_Header Corn (8 row, 30\" spacing)","Harvesting_Grain","Combine_Header","Corn (8 row, 30\" spacing)","8 row\n30\" spacing",115000,110144,"","John Deere","708C",null,null,null,"AGCO Gleaner",3308,null,null,null,"New Holland","980CR-8R",null,null,null,15,100,2.94,null,null,null,null,null,{"$f":"(F38*Fraction_dep_over_optimal_life/X38/Y38)+IF(Machinery_Financed_percentage=0,0,(-CUMIPMT(Interest_Rate/2,Payback_loan_period_years*2,F38*Machinery_Financed_percentage,1,Payback_loan_period_years*2,0)/X38/Y38))+((F38*(1-Machinery_Financed_percentage)*(1+Opportunity_Rate/12)^(Opp_inv_period_years*12)-(F38*(1-Machinery_Financed_percentage)))/X38/Y38)+(Insurance_and_Housing*F38/Y38)","v":80.166649378706268},33.81,{"$f":"Margin_percentage*(AF38+AG38)","v":17.096497406805941},131,null,null,null,null,null,null,"/acre",null,null,null,null,null,2.8,2.94]
["Harvesting_Grain Combine_Header Corn (12 row folding, 30\" spacing)","Harvesting_Grain","Combine_Header","Corn (12 row folding, 30\" spacing)","12 row\n30\" spacing",180000,177474,"","John Deere","712C",null,null,null,"AGCO Gleaner",3312,null,null,null,"New Holland","980CR-12R",null,null,null,15,100,2.94,null,null,null,null,null,125.47823381014894,52.92,26.759735071522343,205,null,null,null,null,null,null,"/acre",null,null,null,null,null,2.8,2.94]
["Harvesting_Grain Combine_Header Corn (16-18 row folding , 30\" spacing)","Harvesting_Grain","Combine_Header","Corn (16-18 row folding , 30\" spacing)","16-18 row\n20-30\" spacing",245000,243500,"","John Deere","716C",null,null,null,"John Deere","718C",null,null,null,"New Holland","980CR-16R",null,null,null,15,100,2.94,null,null,null,null,null,170.7898182415916,72.03,36.422972736238741,279,null,null,null,null,null,null,"/acre",null,null,null,null,null,2.8,2.94]
["Harvesting_Grain Self_propelled_Swather 25 FT","Harvesting_Grain","Self_propelled_Swather","25 FT",null,{"$f":"ROUNDUP(G41/5000,0)*5000","v":225000},223367,"","John Deere","W155 unit with JD 420D header",null,null,null,null,null,null,null,null,null,null,null,null,null,15,200,2.1,22,5.5,25,{"$f":"ROUND((AB41*5280*AC41*Field_efficiency)/43560,0)","v":13}," (acre/hr)",78.423896131343099,23.625,15.307334419701464,117,{"$f":"AA41*Fuel_Price","v":30.799999999999997},{"$f":"Labour","v":27},{"$f":"Margin_percentage*(AJ41+AK41)","v":8.67},null,{"$f":"IF(AI41+AJ41+AK41+AL41+AM41<10,ROUND((AI41+AJ41+AK41+AL41+AM41)/0.25,0)*0.25,ROUND(AI41+AJ41+AK41+AL41+AM41,0))","v":183},{"$f":"IF(AN41/AD41<10,ROUND((AN41/AD41)/0.25,0)*0.25,ROUND(AN41/AD41,0))","v":14},"/acre",null,null,null,null,null,2,2.1]
["Harvesting_Grain Self_propelled_Swather 30 FT","Harvesting_Grain","Self_propelled_Swather","30 FT",null,{"$f":"ROUNDUP(G42/5000,0)*5000","v":265000},263195,"","John Deere","W155-260 unit wth JD 525D header",null,null,null,"Case IH","WD1504-WD 2504 with DH253 header",null,null,null,"New Holland","speedrow 160-260 with 425 HB header",null,null,null,15,200,2.1,32,5.5,30,{"$f":"ROUND((AB42*5280*AC42*Field_efficiency)/43560,0)","v":16}," (acre/hr)",92.365922110248519,27.824999999999999,18.028638316537279,138,{"$f":"AA42*Fuel_Price","v":44.8},{"$f":"Labour","v":27},{"$f":"Margin_percentage*(AJ42+AK42)","v":10.77},null,221,14,"/acre",null,null,null,null,null,2,2.1]
["Harvesting_Grain Self_propelled_Swather 35 FT","Harvesting_Grain","Self_propelled_Swather","35 FT",null,295000,292906,"","Massey Ferguson","WR990 30'",null,null,null,"John Deere","W155-260 unit with 530D header ",null,null,null,"Case IH ","WD1504-WD2504 with DH 303 header",null,null,null,15,200,2.1,36,5.5,35,{"$f":"ROUND((AB43*5280*AC43*Field_efficiency)/43560,0)","v":19}," (acre/hr)",102.8224415944276,30.975000000000001,20.069616239164137,154,{"$f":"AA43*Fuel_Price","v":50.4},{"$f":"Labour","v":27},{"$f":"Margin_percentage*(AJ43+AK43)","v":11.610000000000001},null,243,13,"/acre",null,null,null,null,null,2,2.1]
["Harvesting_Grain Self_propelled_Swather 40 FT","Harvesting_Grain","Self_propelled_Swather","40 FT",null,300000,296314,"","Massey Ferguson","WR9950 35\"",null,null,null,"Massey Ferguson","WR9950 40'",null,null,null,"John Deere","W155-266 unit with 536D-440D header",null,null,null,15,200,2.1,36,5.5,40,{"$f":"ROUND((AB44*5280*AC44*Field_efficiency)/43560,0)","v":21}," (acre/hr)",104.5651948417908,31.5,20.409779226268618,156,{"$f":"AA44*Fuel_Price","v":50.4},{"$f":"Labour","v":27},{"$f":"Margin_percentage*(AJ44+AK44)","v":11.610000000000001},null,245,12,"/acre",null,null,null,null,null,2,2.1]
["Harvesting_Grain Grain_Cart Small (1,000 bu, requires 350 hp)","Harvesting_Grain","Grain_Cart","Small (1,000 bu, requires 350 hp)","1,000 bu",{"$f":"ROUNDUP(G45/5000,0)*5000","v":100000},96075,"","J&M","812-18S",null,null,null,"Brent","V1000 Tracks",null,null,null,null,null,null,null,null,20,250,2.1,null,null,null,null,null,21.913038968358158,8.4,4.5469558452537235,35,null,null,null,{"$f":"AN11","v":279},314,null,null,null,null,null,null,null,2,2.1]
["Harvesting_Grain Grain_Cart Medium (1,400 bu, requires 450 hp)","Harvesting_Grain","Grain_Cart","Medium (1,400 bu, requires 450 hp)","1,400 bu",220000,216685,"","J&M","1122-20S",null,null,null,"Elmers ","1150 Track ",null,null,null,"Elmers","RH Haul Master 1300 tracked",null,null,null,20,250,2.1,null,null,null,null,null,48.208685730387955,18.48,10.003302859558193,77,null,null,null,{"$f":"AN12","v":319},396,null,null,null,null,null,null,null,2,2.1]
["Harvesting_Grain Grain_Cart Large (2,000 bu, requires 550+ hp)","Harvesting_Grain","Grain_Cart","Large (2,000 bu, requires 550+ hp)","2,000 bu",310000,306430,"","Elmers","2000 tracks",null,null,null,"Elmers ","2000 Tracked unit",null,null,null,"J & M ","2300bu tracks",null,null,null,20,250,2.1,null,null,null,null,null,67.930420801910287,26.04,14.095563120286542,108,null,null,null,{"$f":"AN13","v":351},459,null,null,null,null,null,null,null,2,2.1]
["Harvesting_Grain Powered_Auger 8 in. (30-39 FT, 20 hp engine)","Harvesting_Grain","Powered_Auger","8 in. (30-39 FT, 20 hp engine)",null,{"$f":"ROUND(G48,-3)","v":23000},22500,"","Meridian","HD 8-39 Kohler 23 HP",null,null,null,null,null,null,null,null,null,null,null,null,null,20,100,1.58,null,null,null,null,null,12.59999740680594,3.6340000000000003,2.4350996110208909,19,null,null,null,null,null,null,null,null,null,null,null,null,1.5,1.58]
["Harvesting_Grain Powered_Auger 8 in. (40-49 FT, 20 hp engine)","Harvesting_Grain","Powered_Auger","8 in. (40-49 FT, 20 hp engine)",null,24000,23500,"","Wheatheart","XTA 8x41 Kohler 27 hp engine",null,null,null,"Westfield","STX 8x46 Kohler 26.5 hp ngine",null,null,null,null,null,null,null,null,20,100,1.58,null,null,null,null,null,13.147823381014897,3.7920000000000003,2.5409735071522346,19,null,null,null,null,null,null,null,null,null,null,null,null,1.5,1.58]
["Harvesting_Grain Powered_Auger 8 in. (50-59 FT, 25 hp engine)","Harvesting_Grain","Powered_Auger","8 in. (50-59 FT, 25 hp engine)",null,25000,24500,"","Meridian","HD8-39 powered",null,null,null,"Wheatheart","XTA 8x51 Kohler 27 hp engine with movere",null,null,null,null,null,null,null,null,20,100,1.58,null,null,null,null,null,13.69564935522385,3.9500000000000006,2.6468474032835774,20,null,null,null,null,null,null,null,null,null,null,null,null,1.5,1.58]
["Harvesting_Grain Powered_Auger 10 in. (40-49 FT, 35 hp engine)","Harvesting_Grain","Powered_Auger","10 in. (40-49 FT, 35 hp engine)",null,27000,27000,"","Meridian","HD10-46 powered",null,null,null,"Westfield ","STX2 100-41 powered",null,null,null,"Meridian ","FE HD 10-46 Vanguard 37HP efi engine",null,null,null,20,100,1.58,null,null,null,null,null,14.791301303641756,4.266,2.8585951955462634,22,null,null,null,null,null,null,null,null,null,null,null,null,1.5,1.58]
["Harvesting_Grain Powered_Auger 10 in. (50-59 FT, 38 hp engine)","Harvesting_Grain","Powered_Auger","10 in. (50-59 FT, 38 hp engine)",null,31000,31000,"","Meridian","HD 10-53 powered",null,null,null,"Westfield ","STX2 100-51 powered",null,null,null,"Meridian ","HD 10-53 Vanguard 37 hp engine",null,null,null,20,100,1.58,null,null,null,null,null,16.982605200477572,4.8980000000000006,3.2820907800716355,25,null,null,null,null,null,null,null,null,null,null,null,null,1.5,1.58]
["Harvesting_Grain Powered_Auger 12-13 in. u trough (39-40 FT, 38-50 hp engine)","Harvesting_Grain","Powered_Auger","12-13 in. u trough (39-40 FT, 38-50 hp engine)",null,38000,38000,"","Brandt","1340 Model Auger with 48-50HP Diesel motor with mover",null,null,null,null,null,null,null,null,null,null,null,null,null,20,100,1.58,null,null,null,null,null,20.817387019940252,6.0040000000000013,4.0232080529910377,31,null,null,null,null,null,null,null,null,null,null,null,null,1.5,1.58]
["Harvesting_Grain PTO_Grain_Auger 8 in. (30-69 FT, 2,700-3,200 bu/hr, requires 50 hp)","Harvesting_Grain","PTO_Grain_Auger","8 in. (30-69 FT, 2,700-3,200 bu/hr, requires 50 hp)","8\" 30-69 FT\n2,700-3,200 bu/hr",{"$f":"ROUND(G54/500,0)*500","v":12000},12000,"","Westfield","BD PTO WR 80x51",null,null,null,null,null,null,null,null,null,null,null,null,null,20,100,1.05,null,null,null,null,null,6.5739116905074484,1.2600000000000002,1.1750867535761174,{"$f":"IF(AF54+AG54+AH54<10,ROUND((AF54+AG54+AH54)/0.25,0)*0.25,ROUND(AF54+AG54+AH54,0))","v":9},null,null,null,{"$f":"AN8","v":135},{"$f":"IF(AI54+AJ54+AK54+AL54+AM54<10,ROUND((AI54+AJ54+AK54+AL54+AM54)/0.25,0)*0.25,ROUND(AI54+AJ54+AK54+AL54+AM54,0))","v":144},null,null,null,null,null,null,null,1,1.05]
["Harvesting_Grain PTO_Grain_Auger 10 in. (40-89 FT, 5,400 bu/hr, requires 75 hp)","Harvesting_Grain","PTO_Grain_Auger","10 in. (40-89 FT, 5,400 bu/hr, requires 75 hp)","10\" 40-89 FT\n5,400 bu/hr",25000,25000,"","Farmking","Y10-70 swing",null,null,null,"Westfield","MKX 100-73 swing",null,null,null,"Farmking ","Y1070 TMMR",null,null,null,20,100,1.05,null,null,null,null,null,13.69564935522385,2.625,2.4480974032835774,19,null,null,null,{"$f":"AN8","v":135},154,null,null,null,null,null,null,null,1,1.05]
["Harvesting_Grain PTO_Grain_Auger 13 in. (70-120 FT, 9,700 bu/hr, requires 100 hp)","Harvesting_Grain","PTO_Grain_Auger","13 in. (70-120 FT, 9,700 bu/hr, requires 100 hp)","13\" 70-100 FT\n9,700 bu/hr",55000,55000,"","Farmking","Y1395TS",null,null,null,"FarmKing","Y13-85 TMMR",null,null,null,"Farmking ","13-95 TMMR ",null,null,null,20,100,1.05,null,null,null,null,null,30.130428581492467,5.7750000000000004,5.3858142872238695,41,null,null,null,{"$f":"AN8","v":135},176,null,null,null,null,null,null,null,1,1.05]
["Harvesting_Grain PTO_Grain_Auger 16 in. (80-100 FT, 21,000 bu/hr, requires 200 hp)","Harvesting_Grain","PTO_Grain_Auger","16 in. (80-100 FT, 21,000 bu/hr, requires 200 hp)","16\" 80-100 FT\n21,000 bu/hr",90000,90000,"","Westfield","MKX 130-114 swing",null,null,null,"Westfield","X13-94 GLP",null,null,null,"Brandt","1370 swing auger 13\" 70-79ft",null,null,null,20,100,1.05,null,null,null,null,null,49.304337678805858,9.4500000000000011,8.8131506518208784,68,null,null,null,{"$f":"AN9","v":176},244,null,null,null,null,null,null,null,1,1.05]
["Harvesting_Grain PTO_Grain_Auger 16 in. (100+ FT, 21,000 bu/hr, requires 200 hp)","Harvesting_Grain","PTO_Grain_Auger","16 in. (100+ FT, 21,000 bu/hr, requires 200 hp)","16\" 100+ FT\n21,000 bu/hr",{"$f":"ROUND(G58/5000,0)*5000","v":125000},125000,"","Farmking","Y16-104",null,null,null,"Westfield","MKX-160-105 with Rodondo Extend",null,null,null,"Farmking ","Y16104 ",null,null,null,20,100,1.05,null,null,null,null,null,68.478246776119249,13.125,12.240487016417887,94,null,null,null,{"$f":"AN9","v":176},270,null,null,null,null,null,null,null,1,1.05]
["Harvesting_Grain Swath_Roller Drawn (10 FT)","Harvesting_Grain","Swath_Roller","Drawn (10 FT)",null,{"$f":"ROUND(G59/500,0)*500","v":5500},5500,null,null,null,null,null,null,null,null,null,null,null,null,null,null,null,null,20,100,1.05,null,null,null,null,null,3.0130428581492472,0.57750000000000012,{"$f":"Margin_percentage*(AF59+AG59)","v":0.53858142872238712},4.25,null,null,null,null,null,null,"/acre",null,null,null,null,null,1,1.05]
["Harvesting_Grain Swath_Roller Attached (10 FT)","Harvesting_Grain","Swath_Roller","Attached (10 FT)",null,6000,6000,null,null,null,null,null,null,null,null,null,null,null,null,null,null,null,null,20,100,1.05,null,null,null,null,null,3.2869558452537242,0.63000000000000012,0.58754337678805868,4.5,null,null,null,null,null,null,"/acre",null,null,null,null,null,1,1.05]
["Harvesting_Grain PTO_Grain_Conveyor 20-24 in. (90 FT, non swing, requires 100 hp)","Harvesting_Grain","PTO_Grain_Conveyor","20-24 in. (90 FT, non swing, requires 100 hp)","20-24 in. (90 FT, non swing)",{"$f":"ROUND(G61/5000,0)*5000","v":45000},45000,null,null,null,null,null,null,null,null,null,null,null,null,null,null,null,null,10,100,2.21,null,null,null,null,null,44.804337678805858,9.9449999999999985,{"$f":"Margin_percentage*(AF61+AG61)","v":8.2124006518208787},63,null,null,null,{"$f":"AN6","v":116},{"$f":"IF(AI61+AJ61+AK61+AL61+AM61<10,ROUND((AI61+AJ61+AK61+AL61+AM61)/0.25,0)*0.25,ROUND(AI61+AJ61+AK61+AL61+AM61,0))","v":179},null,null,null,null,null,null,null,2.1,2.21]
["Harvesting_Grain PTO_Grain_Conveyor 20-24 in. (100+ FT, swing away, requires 130 hp)","Harvesting_Grain","PTO_Grain_Conveyor","20-24 in. (100+ FT, swing away, requires 130 hp)","20-24 in. (100+ FT, swing away)",100000,100000,null,null,null,null,null,null,null,null,null,null,null,null,null,null,null,null,10,100,2.21,null,null,null,null,null,99.565194841790799,22.1,18.249779226268618,140,null,null,null,{"$f":"AN8","v":135},275,null,null,null,null,null,null,null,2.1,2.21]
["Harvesting_Grain Grain_Bag_Loader Bagger (10 FT, requires 60 hp)","Harvesting_Grain","Grain_Bag_Loader","Bagger (10 FT, requires 60 hp)","10 FT Bagger",{"$f":"ROUND(G63,-3)","v":40000},40000,null,null,null,null,null,null,null,null,null,null,null,null,null,null,null,null,12,100,2.1,null,null,null,null,null,33.855064947263593,8.4,6.3382597420895381,49,null,null,null,{"$f":"AN6","v":116},165,null,null,null,null,null,null,null,2,2.1]
["Harvesting_Grain Grain_Bag_Loader Bagger (12 FT, requires 125 hp)","Harvesting_Grain","Grain_Bag_Loader","Bagger (12 FT, requires 125 hp)","12 FT Bagger",50000,50000,null,null,null,null,null,null,null,null,null,null,null,null,null,null,null,null,12,100,2.1,null,null,null,null,null,42.318831184079492,10.5,7.9228246776119233,61,null,null,null,{"$f":"AN7","v":127},188,null,null,null,null,null,null,null,2,2.1]
["Harvesting_Grain Grain_Bag_Extractor Unloader (10 FT, requires 60 hp)","Harvesting_Grain","Grain_Bag_Extractor","Unloader (10 FT, requires 60 hp)","10 FT Unloader",{"$f":"ROUND(G65,-3)","v":40000},40000,null,null,null,null,null,null,null,null,null,null,null,null,null,null,null,null,12,100,2.1,null,null,null,null,null,{"$f":"(F65*Fraction_dep_over_optimal_life/X65/Y65)+IF(Machinery_Financed_percentage=0,0,(-CUMIPMT(Interest_Rate/2,Payback_loan_period_years*2,F65*Machinery_Financed_percentage,1,Payback_loan_period_years*2,0)/X65/Y65))+((F65*(1-Machinery_Financed_percentage)*(1+Opportunity_Rate/12)^(Opp_inv_period_years*12)-(F65*(1-Machinery_Financed_percentage)))/X65/Y65)+(Insurance_and_Housing*F65/Y65)","v":33.855064947263593},{"$f":"Z65/100*F65/Y65","v":8.4},{"$f":"Margin_percentage*(AF65+AG65)","v":6.3382597420895381},49,null,null,null,{"$f":"AN6","v":116},165,null,null,null,null,null,null,null,2,2.1]
["Harvesting_Grain Grain_Bag_Extractor Unloader (12 FT, requires 100 hp)","Harvesting_Grain","Grain_Bag_Extractor","Unloader (12 FT, requires 100 hp)","12 FT Unloader",{"$f":"ROUND(G66/5000,0)*5000","v":50000},50000,null,null,null,null,null,null,null,null,null,null,null,null,null,null,null,null,12,100,2.1,null,null,null,null,null,42.318831184079492,10.5,7.9228246776119233,61,null,null,null,{"$f":"AN7","v":127},188,null,null,null,null,null,null,null,2,2.1]
["Harvesting_Grain Grain_Dryer 275-370 bu/hr","Harvesting_Grain","Grain_Dryer","275-370 bu/hr",null,100000,100000,null,null,null,null,null,null,null,null,null,null,null,null,null,null,null,null,15,150,1.37,null,null,null,null,null,46.473419929684795,9.1333333333333329,{"$f":"Margin_percentage*(AF67+AG67)","v":8.3410129894527181},64,null,null,null,null,null,null,null,null,null,null,null,null,1.3,1.37]
["Harvesting_Grain Grain_Dryer 420-610 bu/hr","Harvesting_Grain","Grain_Dryer","420-610 bu/hr",null,150000,150000,null,null,null,null,null,null,null,null,null,null,null,null,null,null,null,null,15,150,1.37,null,null,null,null,null,69.710129894527199,13.7,12.511519484179081,96,null,null,null,null,null,null,null,null,null,null,null,null,1.3,1.37]
["Harvesting_Grain Grain_Dryer 710-910 bu/hr","Harvesting_Grain","Grain_Dryer","710-910 bu/hr",null,200000,200000,null,null,null,null,null,null,null,null,null,null,null,null,null,null,null,null,15,150,1.37,null,null,null,null,null,92.946839859369589,18.266666666666666,16.682025978905436,128,null,null,null,null,null,null,null,null,null,null,null,null,1.3,1.37]
["Harvesting_Grain Grain_Dryer 1060-1180 bu/hr","Harvesting_Grain","Grain_Dryer","1060-1180 bu/hr",null,250000,250000,null,null,null,null,null,null,null,null,null,null,null,null,null,null,null,null,15,150,1.37,null,null,null,null,null,116.18354982421202,22.833333333333332,20.852532473631801,160,null,null,null,null,null,null,null,null,null,null,null,null,1.3,1.37]
["Harvesting_Grain Grain_Dryer 1440-2380 bu/hr","Harvesting_Grain","Grain_Dryer","1440-2380 bu/hr",null,300000,300000,null,null,null,null,null,null,null,null,null,null,null,null,null,null,null,null,15,150,1.37,null,null,null,null,null,139.4202597890544,27.4,25.023038968358161,192,null,null,null,null,null,null,null,null,null,null,null,null,1.3,{"$f":"ROUND((AV71*$AW$2)+AV71,2)","v":1.37}]
["Harvesting_Grain Grain_Vac 2,400-5,000 bu/hr (requires 70 hp)","Harvesting_Grain","Grain_Vac","2,400-5,000 bu/hr (requires 70 hp)","2,400-5,000 bu/hr",{"$f":"ROUND(G72,-3)","v":45000},45000,"","Brandt","5200 EX",null,null,null,"Walinga","6614 DLX Grain vac",null,null,null,null,null,null,null,null,15,50,2.1,null,null,null,null,null,62.739116905074468,18.900000000000002,12.245867535761171,94,null,null,null,{"$f":"AN6","v":116},{"$f":"IF(AI72+AJ72+AK72+AL72+AM72<10,ROUND((AI72+AJ72+AK72+AL72+AM72)/0.25,0)*0.25,ROUND(AI72+AJ72+AK72+AL72+AM72,0))","v":210},null,null,null,null,null,null,null,2,2.1]
["Harvesting_Grain Grain_Vac 6,000-10,000 bu/hr (requires 120 hp)","Harvesting_Grain","Grain_Vac","6,000-10,000 bu/hr (requires 120 hp)","6,000-10,000 bu/hr",65000,65000,"","REM ","VR12",null,null,null,"AGI","VR12 ",null,null,null,"REM ","VRX Grain Vac",null,null,null,15,50,2.1,null,null,null,null,null,90.623168862885336,27.3,17.688475329432798,136,null,null,null,{"$f":"AN7","v":127},263,null,null,null,null,null,null,null,2,2.1]
["Harvesting_Hay Self_propelled_Forage_Harvester Small (400-599 hp)","Harvesting_Hay","Self_propelled_Forage_Harvester","Small (400-599 hp)","400-599 hp",525000,538598,"","John Deere",8400,null,null,null,"New Holland","FR480",null,null,null,"Claas",940,null,null,null,10,400,8.4,79,null,null,null,null,130.67931822985042,110.25,36.139397734477562,277,{"$f":"AA74*Fuel_Price","v":110.6},{"$f":"Labour","v":27},{"$f":"Margin_percentage*(AJ74+AK74)","v":20.639999999999997},null,435,null,"/acre",null,null,null,null,null,8,8.4]
["Harvesting_Hay Self_propelled_Forage_Harvester Medium (600-799 hp)","Harvesting_Hay","Self_propelled_Forage_Harvester","Medium (600-799 hp)","600-799 hp",675000,684585,"","John Deere",9600,null,null,null,"New Holland","FR650",null,null,null,"Claas",960,null,null,null,10,400,8.4,103,null,null,null,null,168.01626629552194,141.75,46.464939944328293,356,{"$f":"AA75*Fuel_Price","v":144.19999999999999},{"$f":"Labour","v":27},{"$f":"Margin_percentage*(AJ75+AK75)","v":25.679999999999996},null,553,null,"/acre",null,null,null,null,null,8,8.4]
["Harvesting_Hay Self_propelled_Forage_Harvester Large (800-899 hp)","Harvesting_Hay","Self_propelled_Forage_Harvester","Large (800-899 hp)","800-899 hp",{"$f":"ROUNDUP(G76/50000,0)*50000","v":750000},748511,"","John Deere",9800,null,null,null,"New Holland","FR920",null,null,null,"Claas",980,null,null,null,10,400,8.4,121,null,null,null,null,186.68474032835775,157.50000000000003,51.627711049253662,396,{"$f":"AA76*Fuel_Price","v":169.39999999999998},{"$f":"Labour","v":27},{"$f":"Margin_percentage*(AJ76+AK76)","v":29.459999999999994},null,622,null,"/acre",null,null,null,null,null,8,8.4]
["Harvesting_Hay SP_Forage_Harvester_Header Windrow Pickup (12-17 FT width)","Harvesting_Hay","SP_Forage_Harvester_Header","Windrow Pickup (12-17 FT width)","12-17 FT",{"$f":"ROUND(G77/5000,0)*5000","v":60000},60000,"","John Deere","4.0m/4.5m WRPU",null,null,null,"New Holland","12.5 HDY PU",null,null,null,"Class","10'/12.6' PU",null,null,null,10,400,8.4,null,6.5,27.5,{"$f":"ROUND((AB77*5280*AC77*Field_efficiency)/43560,0)","v":17}," (acre/hr)",14.934779226268615,12.6,4.1302168839402924,32,null,null,null,null,32,null,"/acre",{"$f":"IF(AN77/AD77<10,ROUND((AN77/AD77)/0.25,0)*0.25,ROUND(AN77/AD77,0))","v":2},null,null,null,null,8,8.4]
["Harvesting_Hay SP_Forage_Harvester_Header Corn (14-20 FT width)","Harvesting_Hay","SP_Forage_Harvester_Header","Corn (14-20 FT width)",null,{"$f":"ROUND(G78/25000,0)*25000","v":175000},163187,"","John Deere","676/ 696",null,null,null,"New Holland","450FI/600FI",null,null,null,"Claas","Orbis 600",null,null,null,10,400,8.4,null,6.5,14,9," (acre/hr)",43.559772743283474,36.750000000000007,12.04646591149252,92,null,null,null,null,92,null,"/acre",{"$f":"IF(AN78/AD78<10,ROUND((AN78/AD78)/0.25,0)*0.25,ROUND(AN78/AD78,0))","v":10},null,null,null,null,8,8.4]
["Harvesting_Hay SP_Forage_Harvester_Header Corn (21-30 FT width)","Harvesting_Hay","SP_Forage_Harvester_Header","Corn (21-30 FT width)",null,225000,225019,"","John Deere","690 / 692",null,null,null,"New Holland","750FI/990FI",null,null,null,"Claas","Orbis 750/900",null,null,null,10,400,8.4,null,6.5,21,13," (acre/hr)",56.005422098507317,47.25,15.488313314776098,119,null,null,null,null,119,null,"/acre",9.25,null,null,null,null,8,8.4]
["Harvesting_Hay Pull_Type_Forage_Harvester For up to 150 hp tractor","Harvesting_Hay","Pull_Type_Forage_Harvester","For up to 150 hp tractor",null,{"$f":"ROUND(G80/5000,0)*5000","v":70000},{"$f":"55000*1.25","v":68750},null,null,null,null,null,null,null,null,null,null,null,null,null,null,null,null,10,100,8.4,null,null,null,null,null,69.695636389253551,58.8,{"$f":"Margin_percentage*(AF80+AG80)","v":19.27434545838803},148,null,null,null,{"$f":"AN8","v":135},null,null,"/acre",null,null,null,null,null,8,8.4]
["Harvesting_Hay Pull_Type_Forage_Harvester For 151 to 250 hp tractor","Harvesting_Hay","Pull_Type_Forage_Harvester","For 151 to 250 hp tractor",null,95000,{"$f":"75000*1.25","v":93750},null,null,null,null,null,null,null,null,null,null,null,null,null,null,null,null,10,100,8.4,null,null,null,null,null,94.586935099701265,79.800000000000011,26.15804026495519,201,null,null,null,{"$f":"AN9","v":176},null,null,"/acre",null,null,null,null,null,8,8.4]
["Harvesting_Hay Pull_Type_Forage_Harvester For up to 300 hp tractor","Harvesting_Hay","Pull_Type_Forage_Harvester","For up to 300 hp tractor",null,105000,{"$f":"85000*1.25","v":106250},null,null,null,null,null,null,null,null,null,null,null,null,null,null,null,null,10,100,8.4,null,null,null,null,null,104.54345458388035,88.2,28.91151818758205,222,null,null,null,213,null,null,"/acre",null,null,null,null,null,8,8.4]
["Harvesting_Hay PT_Forage_Harvester_Header Windrow Pickup (70-79 in. width)","Harvesting_Hay","PT_Forage_Harvester_Header","Windrow Pickup (70-79 in. width)",null,{"$f":"ROUND(G83/500,0)*500","v":10000},{"$f":"8000*1.25","v":10000},null,null,null,null,null,null,null,null,null,null,null,null,null,null,null,null,10,100,8.4,null,5.5,5.8,{"$f":"ROUND((AB83*5280*AC83*Field_efficiency)/43560,1)","v":3.1}," (acre/hr)",{"$f":"(F83*Fraction_dep_over_optimal_life/X83/Y83)+IF(Machinery_Financed_percentage=0,0,(-CUMIPMT(Interest_Rate/2,Payback_loan_period_years*2,F83*Machinery_Financed_percentage,1,Payback_loan_period_years*2,0)/X83/Y83))+((F83*(1-Machinery_Financed_percentage)*(1+Opportunity_Rate/12)^(Opp_inv_period_years*12)-(F83*(1-Machinery_Financed_percentage)))/X83/Y83)+(Insurance_and_Housing*F83/Y83)","v":9.9565194841790774},{"$f":"Z83/100*F83/Y83","v":8.4},{"$f":"Margin_percentage*(AF83+AG83)","v":2.7534779226268618},21,null,null,null,null,{"$f":"IF(AI83+AJ83+AK83+AL83+AM83<10,ROUND((AI83+AJ83+AK83+AL83+AM83)/0.25,0)*0.25,ROUND(AI83+AJ83+AK83+AL83+AM83,0))","v":21},null,"/acre",{"$f":"IF(AN83/AD83<10,ROUND((AN83/AD83)/0.25,0)*0.25,ROUND(AN83/AD83,0))","v":6.75},null,null,null,null,8,8.4]
["Harvesting_Hay PT_Forage_Harvester_Header Windrow Pickup (80-96 in. width)","Harvesting_Hay","PT_Forage_Harvester_Header","Windrow Pickup (80-96 in. width)",null,{"$f":"ROUND(G84,-3)","v":18000},{"$f":"14000*1.25","v":17500},null,null,null,null,null,null,null,null,null,null,null,null,null,null,null,null,10,100,8.4,null,5.5,6.7,{"$f":"ROUND((AB84*5280*AC84*Field_efficiency)/43560,1)","v":3.6}," (acre/hr)",17.921735071522345,15.12,4.9562602607283521,38,null,null,null,null,38,null,"/acre",11,null,null,null,null,8,8.4]
["Harvesting_Hay PT_Forage_Harvester_Header Corn (2 row)","Harvesting_Hay","PT_Forage_Harvester_Header","Corn (2 row)",null,18000,{"$f":"14000*1.25","v":17500},null,null,null,null,null,null,null,null,null,null,null,null,null,null,null,null,10,100,8.4,null,5,5,{"$f":"ROUND((AB85*5280*AC85*Field_efficiency)/43560,1)","v":2.4}," (acre/hr)",17.921735071522345,15.12,4.9562602607283521,38,null,null,null,null,38,null,"/acre",16,null,null,null,null,8,8.4]
["Harvesting_Hay PT_Forage_Harvester_Header Corn (3 row)","Harvesting_Hay","PT_Forage_Harvester_Header","Corn (3 row)",null,35000,{"$f":"28000*1.25","v":35000},null,null,null,null,null,null,null,null,null,null,null,null,null,null,null,null,10,100,8.4,null,5,7.5,{"$f":"ROUND((AB86*5280*AC86*Field_efficiency)/43560,1)","v":3.6}," (acre/hr)",34.847818194626775,29.4,9.637172729194015,74,null,null,null,null,74,null,"/acre",21,null,null,null,null,8,8.4]
["Harvesting_Hay Self_propelled_Mower_Conditioner Disc Mower Conditioner (13-19 FT)","Harvesting_Hay","Self_propelled_Mower_Conditioner","Disc Mower Conditioner (13-19 FT)",null,250000,{"$f":"189217+43049","v":232266},"","John Deere","W260 with 994/995/500R rotary header",null,null,null,"Case IH","WD2504 with RD163/RD193 disc header",null,null,null,"New Holland","Speedrower 260 with 19ft durabine",null,null,null,15,150,3.36,36,8,16,12," (acre/hr)",116.18354982421202,56,25.827532473631805,198,{"$f":"AA87*Fuel_Price","v":50.4},{"$f":"Labour","v":27},{"$f":"Margin_percentage*(AJ87+AK87)","v":11.610000000000001},null,287,{"$f":"IF(AN87/AD87<10,ROUND((AN87/AD87)/0.25,0)*0.25,ROUND(AN87/AD87,0))","v":24},"/acre",null,null,null,null,null,3.2,3.36]
["Harvesting_Hay Self_propelled_Mower_Conditioner Disc Mower Conditioner (30 FT)","Harvesting_Hay","Self_propelled_Mower_Conditioner","Disc Mower Conditioner (30 FT)",null,450000,472000,"","Krone","Big M 450",null,null,null,null,null,null,null,null,null,null,null,null,null,15,150,3.36,64,8,30,23," (acre/hr)",209.13038968358157,{"$f":"Z88/100*F88/Y88","v":100.79999999999998},46.489558452537231,356,{"$f":"AA88*Fuel_Price","v":89.6},{"$f":"Labour","v":27},{"$f":"Margin_percentage*(AJ88+AK88)","v":17.489999999999998},null,490,21,"/acre",null,null,null,null,null,3.2,3.36]
["Harvesting_Hay Self_propelled_Mower_Conditioner Sickle Mower Conditioner (14-18 FT)","Harvesting_Hay","Self_propelled_Mower_Conditioner","Sickle Mower Conditioner (14-18 FT)",null,{"$f":"ROUNDUP(G89/5000,0)*5000","v":225000},{"$f":"189217+32883","v":222100},{"$f":"IFERROR(AVERAGE(M89,R89,W89),\"\")","v":""},"Case IH","WD2504 with 14/16/18/dual Skl dul aug HDX",null,null,null,"Massey Ferguson","WR9950 with 14-18' sickle head",null,null,null,"New Holland","Speedrower 260 w haybine 16HS",null,null,null,15,150,3.36,32,6,16,9," (acre/hr)",104.56519484179078,50.399999999999991,23.244779226268616,178,{"$f":"AA89*Fuel_Price","v":44.8},{"$f":"Labour","v":27},{"$f":"Margin_percentage*(AJ89+AK89)","v":10.77},null,261,29,"/acre",null,null,null,null,null,3.2,3.36]
[{"$f":"B90&\" \"&C90&\" \"&D90","v":"Harvesting_Hay Pull_Type_Mower_Conditioner Sickle (9-10 FT, requires 50 hp) "},"Harvesting_Hay","Pull_Type_Mower_Conditioner","Sickle (9-10 FT, requires 50 hp) ","9-10 FT ",30000,{"$f":"25000*1.15","v":28749.999999999996},"","New Holland","Haybine 488",null,null,null,null,null,null,null,null,null,null,null,null,null,15,150,2.1,null,5,8,4," (acre/hr)",{"$f":"(F90*Fraction_dep_over_optimal_life/X90/Y90)+IF(Machinery_Financed_percentage=0,0,(-CUMIPMT(Interest_Rate/2,Payback_loan_period_years*2,F90*Machinery_Financed_percentage,1,Payback_loan_period_years*2,0)/X90/Y90))+((F90*(1-Machinery_Financed_percentage)*(1+Opportunity_Rate/12)^(Opp_inv_period_years*12)-(F90*(1-Machinery_Financed_percentage)))/X90/Y90)+(Insurance_and_Housing*F90/Y90)","v":13.942025978905438},{"$f":"Z90/100*F90/Y90","v":4.2},{"$f":"Margin_percentage*(AF90+AG90)","v":2.7213038968358156},21,null,null,null,{"$f":"AN6","v":116},137,34,"/acre",null,null,null,null,null,2,2.1]
["Harvesting_Hay Pull_Type_Mower_Conditioner Sickle (14-16 FT, requires 100 hp) ","Harvesting_Hay","Pull_Type_Mower_Conditioner","Sickle (14-16 FT, requires 100 hp) ","14-16 FT",55000,56978,"","New Holland","H7150",null,null,null,"Case IH","SC101-HDX142",null,null,null,null,null,null,null,null,15,150,2.1,null,6,14,8," (acre/hr)",25.56038096132664,{"$f":"Z91/100*F91/Y91","v":7.7},4.9890571441989957,38,null,null,null,{"$f":"AN6","v":116},154,19,"/acre",null,null,null,null,null,2,2.1]
["Harvesting_Hay Pull_Type_Mower_Conditioner Disc (7-9 FT side pull, requires 60 hp) ","Harvesting_Hay","Pull_Type_Mower_Conditioner","Disc (7-9 FT side pull, requires 60 hp) ","7-9 FT side pull",40000,38915,"","John Deere","630 side pull",null,null,null,"Massey Ferguson",1359,null,null,null,null,null,null,null,null,15,150,2.63,null,8,9,7," (acre/hr)",18.589367971873916,{"$f":"Z92/100*F92/Y92","v":7.0133333333333336},3.840405195781087,29,null,null,null,{"$f":"AN6","v":116},145,21,"/acre",null,null,null,null,null,2.5,2.63]
["Harvesting_Hay Pull_Type_Mower_Conditioner Disc (14 FT, requires 90 hp) ","Harvesting_Hay","Pull_Type_Mower_Conditioner","Disc (14 FT, requires 90 hp) ","14 FT",55000,54357,"","New Holland","Discbine 313",null,null,null,"Massey Ferguson",1373,null,null,null,"John Deere","946 Mid Pivot",null,null,null,15,150,2.63,null,8,12,9," (acre/hr)",25.56038096132664,9.6433333333333326,5.2805571441989958,40,null,null,null,{"$f":"AN6","v":116},156,17,"/acre",null,null,null,null,null,2.5,2.63]
["Harvesting_Hay Pull_Type_Mower_Conditioner Disc (16-18 FT, requires 100 hp) ","Harvesting_Hay","Pull_Type_Mower_Conditioner","Disc (16-18 FT, requires 100 hp) ","16-18 FT",65000,62975,"","New Holland","Discbine 316",null,null,null,"Massey Ferguson",1393,null,null,null,"John Deere","956 Mid Pivot",null,null,null,15,150,2.63,null,8,15,12," (acre/hr)",30.207722954295114,11.396666666666667,6.2406584431442669,48,null,null,null,{"$f":"AN6","v":116},164,14,"/acre",null,null,null,null,null,2.5,2.63]
["Harvesting_Hay Hay_Rakes 16-20 FT bar (requires 50 hp)","Harvesting_Hay","Hay_Rakes","16-20 FT bar (requires 50 hp)","16-20 FT bar",{"$f":"ROUND(G95,-3)","v":15000},15000,"no bar rake options in these prices","Case IH","WR102 ",null,null,null,"New Holland","Duravee 817",null,null,null,"Massey Ferguson",1508,null,null,null,20,50,2.1,null,6.5,16,{"$f":"ROUND((AB95*5280*AC95*Field_efficiency)/43560,0)","v":10}," (acre/hr)",16.434779226268617,6.3,{"$f":"Margin_percentage*(AF95+AG95)","v":3.4102168839402927},26,null,null,null,{"$f":"AN6","v":116},142,14,"/acre",null,null,null,null,null,2,2.1]
["Harvesting_Hay Hay_Rakes 21-30 FT wheel (requires 50 hp)","Harvesting_Hay","Hay_Rakes","21-30 FT wheel (requires 50 hp)","21-30 FT wheel",30000,30000,null,"Farmking","RE 14",null,null,null,"New Holland","Duravee 1225",null,null,null,"Case IH","WR201",null,null,null,20,50,2.1,null,6.5,21,{"$f":"ROUND((AB96*5280*AC96*Field_efficiency)/43560,0)","v":13}," (acre/hr)",32.869558452537234,12.6,6.8204337678805853,52,null,null,null,{"$f":"AN6","v":116},168,13,"/acre",null,null,null,null,null,2,2.1]
["Harvesting_Hay Hay_Rakes 31-40 FT wheel (requires 50 hp)","Harvesting_Hay","Hay_Rakes","31-40 FT wheel (requires 50 hp)","31-40 FT wheel",45000,45000,null,"John Deere","WR1216",null,null,null,"New Holland","Duravee 2036",null,null,null,"Case IH","WR302",null,null,null,20,50,2.1,null,6.5,31,{"$f":"ROUND((AB97*5280*AC97*Field_efficiency)/43560,0)","v":20}," (acre/hr)",49.304337678805858,18.900000000000002,10.230650651820879,78,null,null,null,{"$f":"AN6","v":116},194,9.75,"/acre",null,null,null,null,null,2,2.1]
["Harvesting_Hay Baler_Large_Round 4x5 FT bales (requires 80 hp)","Harvesting_Hay","Baler_Large_Round","4x5 FT bales (requires 80 hp)","4x5 FT bale",48000,48450,"","Vermeer","404 Pro",null,null,null,"New Holland","RF 440",null,null,null,"John Deere","440E",null,null,null,15,100,1.58,null,0,0,15," (bales/hr)",33.460862349373052,{"$f":"Z98/100*F98/Y98","v":7.5840000000000005},6.1567293524059581,47,null,null,null,{"$f":"AN6","v":116},163,11,"/bale",null,null,null,null,null,1.5,1.58]
["Harvesting_Hay Baler_Large_Round 5x5 FT bales (requires 135 hp)","Harvesting_Hay","Baler_Large_Round","5x5 FT bales (requires 135 hp)","5x5 FT bale",55000,55000,"","Vermeer","504 PRO",null,null,null,"New Holland","RF 450",null,null,null,"John Deere","450E",null,null,null,15,100,1.58,null,0,0,12," (bales/hr)",38.340571441989958,{"$f":"Z99/100*F99/Y99","v":8.6900000000000013},7.0545857162984946,54,null,null,null,{"$f":"AN8","v":135},189,16,"/bale",null,null,null,null,null,1.5,1.58]
["Harvesting_Hay Baler_Large_Round 5x6 FT bales (requires 135 hp)","Harvesting_Hay","Baler_Large_Round","5x6 FT bales (requires 135 hp)","5x6 FT bale",{"$f":"ROUND(G100/5000,0)*5000","v":75000},76180,"","Vermeer","604R Classic",null,null,null,"New Holland","Rollbelt 460",null,null,null,"John Deere","460M",null,null,null,15,100,1.58,null,0,0,13," (bales/hr)",52.282597420895399,11.850000000000001,9.6198896131343083,74,null,null,null,{"$f":"AN8","v":135},209,16,"/bale",null,null,null,null,null,1.5,1.58]
["Harvesting_Hay Baler_Large_Round 5x5 FT silage, net wrap bales (requires 135 hp)","Harvesting_Hay","Baler_Large_Round","5x5 FT silage, net wrap bales (requires 135 hp)","5x5 FT bale",65000,65000,"","Vermeer","5520 Rebel",null,null,null,"John Deere","550M",null,null,null,null,null,null,null,null,15,100,1.58,null,0,0,16," (bales/hr)",45.311584431442668,10.27,8.3372376647163993,64,null,null,null,{"$f":"AN8","v":135},199,12,"/bale",null,null,null,null,null,1.5,1.58]
["Harvesting_Hay Baler_Large_Round 5x6 FT silage, net wrap bales (requires 135 hp)","Harvesting_Hay","Baler_Large_Round","5x6 FT silage, net wrap bales (requires 135 hp)","5x6 FT bale",{"$f":"ROUND(G102/5000,0)*5000","v":85000},86180,"","Vermeer","605N",null,null,null,"New Holland","Rollbelt 560",null,null,null,"John Deere","560M",null,null,null,15,100,1.58,null,0,0,17," (bales/hr)",59.253610410348109,13.430000000000001,10.902541561552216,84,null,null,null,{"$f":"AN8","v":135},219,13,"/bale",null,null,null,null,null,1.5,1.58]
["Harvesting_Hay Baler_Small_Square 14x18x52 in. bales (requires 50 hp)","Harvesting_Hay","Baler_Small_Square","14x18x52 in. bales (requires 50 hp)","14x18x52\" bale",{"$f":"ROUNDUP(G103,-3)","v":30000},29450,"","Case IH","SB531",null,null,null,"New Holland","BC5060",null,null,null,"John Deere",328,null,null,null,20,100,1.05,null,0,0,175," (bales/hr)",16.434779226268617,{"$f":"Z103/100*F103/Y103","v":3.15},2.9377168839402921,23,null,null,null,{"$f":"AN6","v":116},139,0.75,"/bale",null,null,null,null,null,1,1.05]
["Harvesting_Hay Baler_Small_Square 16x18x52 in. bales (requires 50 hp)","Harvesting_Hay","Baler_Small_Square","16x18x52 in. bales (requires 50 hp)","16x18x52\" bale",45000,44635,"","Massey Ferguson",1842,null,null,null,"New Holland","BC5070",null,null,null,null,null,null,null,null,20,100,1.05,null,0,0,175," (bales/hr)",24.652168839402929,4.7250000000000005,4.4065753259104392,34,null,null,null,{"$f":"AN6","v":116},150,0.75,"/bale",null,null,null,null,null,1,1.05]
["Harvesting_Hay Baler_Large_Square Small, 35x31x108 in. (requires 145 hp)","Harvesting_Hay","Baler_Large_Square","Small, 35x31x108 in. (requires 145 hp)","35x31x108\" bale",{"$f":"ROUND(G105/5000,0)*5000","v":160000},160000,"","Case IH","LB334XL",null,null,null,"New Holland","Big Baler 330 Plus",null,null,null,"John Deere","L331",null,null,null,15,150,1.79,null,0,0,40," (bales/hr)",74.357471887495663,{"$f":"Z105/100*F105/Y105","v":19.093333333333334},14.017620783124348,107,null,null,null,{"$f":"AN8","v":135},242,6,"/bale",null,null,null,null,null,1.7,1.79]
["Harvesting_Hay Baler_Large_Square Medium, 35x47x108 in. (requires 145 hp)","Harvesting_Hay","Baler_Large_Square","Medium, 35x47x108 in. (requires 145 hp)","35x47x108\" bale",180000,180000,"","Case IH","LB434XL",null,null,null,"New Holland","Big Baler 340 Plus",null,null,null,"John Deere","L341",null,null,null,15,150,1.79,null,0,0,40," (bales/hr)",83.652155873432619,{"$f":"Z106/100*F106/Y106","v":21.48},15.769823381014893,121,null,null,null,{"$f":"AN8","v":135},256,6.5,"/bale",null,null,null,null,null,1.7,1.79]
["Harvesting_Hay Baler_Large_Square Large, 50x47x108 in. (requires 180 hp)","Harvesting_Hay","Baler_Large_Square","Large, 50x47x108 in. (requires 180 hp)","50x47x108\" bale",225000,225000,"","Krone","BP 4x4",null,null,null,"Massey Ferguson",2290,null,null,null,null,null,null,null,null,15,150,1.79,null,0,0,40," (bales/hr)",104.56519484179078,26.85,19.712279226268617,151,null,null,null,{"$f":"AN9","v":176},327,8.25,"/bale",null,null,null,null,null,1.7,1.79]
["Harvesting_Hay Pull_Type_Bale_Mover_Self_load_unload Round Bale 7-12 bale (requires 120 hp)","Harvesting_Hay","Pull_Type_Bale_Mover_Self_load_unload","Round Bale 7-12 bale (requires 120 hp)",null,{"$f":"ROUNDUP(G108/5000,0)*5000","v":40000},39056,"","Highline","BM607",null,null,null,"Farm King",1450,null,null,null,null,null,null,null,null,15,100,2.63,null,null,null,null,null,27.884051957810872,{"$f":"Z108/100*F108/Y108","v":10.52},5.7606077936716309,44,null,null,null,{"$f":"AN8","v":135},179,null,null,null,null,null,null,null,2.5,2.63]
["Harvesting_Hay Pull_Type_Bale_Mover_Self_load_unload Round Bale 12-18 bale (requires 180 hp)","Harvesting_Hay","Pull_Type_Bale_Mover_Self_load_unload","Round Bale 12-18 bale (requires 180 hp)",null,{"$f":"ROUNDUP(G109/5000,0)*5000","v":70000},67180,"","Morris/ProAg",2200,null,null,null,"Farm King",2450,null,null,null,null,null,null,null,null,15,100,2.63,null,null,null,null,null,48.797090926169027,{"$f":"Z109/100*F109/Y109","v":18.41},10.081063638925354,77,null,null,null,{"$f":"AN9","v":176},253,null,null,null,null,null,null,null,2.5,2.63]
["Harvesting_Hay Pull_Type_Bale_Mover_Self_load_unload Large Square 4-6 bale (requires 120 hp)","Harvesting_Hay","Pull_Type_Bale_Mover_Self_load_unload","Large Square 4-6 bale (requires 120 hp)",null,80000,79000,"","Extrapolation","10% increase over 20/21",null,null,null,null,null,null,null,null,null,null,null,null,null,20,200,2.1,null,null,null,null,null,21.913038968358155,{"$f":"Z110/100*F110/Y110","v":8.4},4.5469558452537235,35,null,null,null,{"$f":"AN8","v":135},170,null,null,null,null,null,null,null,2,2.1]
["Harvesting_Hay Pull_Type_Bale_Mover_Self_load_unload Large Square 6-12 bale (requires 180 hp)","Harvesting_Hay","Pull_Type_Bale_Mover_Self_load_unload","Large Square 6-12 bale (requires 180 hp)",null,90000,{"$f":"80000*1.15","v":92000},"","Highline","Fastack 1200 Flex",null,null,null,null,null,null,null,null,null,null,null,null,null,20,200,2.1,null,null,null,null,null,24.652168839402929,9.4500000000000011,5.1153253259104394,39,null,null,null,{"$f":"AN9","v":176},215,null,null,null,null,null,null,null,2,2.1]
["Harvesting_Hay Pull_Type_Bale_Mover_Self_load_unload Large Square 12-20 bale (requires 220 hp)","Harvesting_Hay","Pull_Type_Bale_Mover_Self_load_unload","Large Square 12-20 bale (requires 220 hp)",null,115000,{"$f":"100000*1.15","v":114999.99999999999},"","Highline","Fastack 1800 Flex",null,null,null,"Farm King","4480XD",null,null,null,null,null,null,null,null,20,200,2.1,null,null,null,null,null,31.499993517014854,12.074999999999999,6.5362490275522278,50,null,null,null,{"$f":"AN9","v":176},226,null,null,null,null,null,null,null,2,2.1]
[{"$f":"B113&\" \"&C113&\" \"&D113","v":"Harvesting_Hay Self_propelled_Bale_Mover Self propelled Small Square Bale Wagon"},"Harvesting_Hay","Self_propelled_Bale_Mover","Self propelled Small Square Bale Wagon",null,345000,346134,"","New Holland","Stackcruiser 102",null,null,null,"New Holland","Stackcruiser 103",null,null,null,"New Holland","Stackcruiser 105",null,null,null,15,150,2.63,28,null,null,null,null,160.33329875741254,{"$f":"Z113/100*F113/Y113","v":60.49},33.123494813611877,254,{"$f":"AA113*Fuel_Price","v":39.199999999999996},{"$f":"Labour","v":27},{"$f":"Margin_percentage*(AJ113+AK113)","v":9.9299999999999979},null,330,null,null,null,null,null,null,null,2.5,2.63]
[{"$f":"B114&\" \"&C114&\" \"&D114","v":"Seeding Air_Drills_with_Independent_Opener Small, 25-45 FT (requires 400 hp)"},"Seeding","Air_Drills_with_Independent_Opener","Small, 25-45 FT (requires 400 hp)","25-45 FT",{"$f":"ROUND(G114/25000,0)*25000","v":400000},397466.4,"","John Deere ","N530F 30ft with 1910 cart 350 bu",null,null,null,null,null,null,null,null,null,null,null,null,null,15,200,3.68,null,4.75,35,{"$f":"ROUND((AB114*5280*AC114*Field_efficiency*0.875)/43560,0)","v":14}," (acre/hr)",139.4202597890544,73.599999999999994,31.953038968358157,245,null,null,null,{"$f":"AN11","v":279},524,{"$f":"IF(AN114/AD114<10,ROUND((AN114/AD114)/0.25,0)*0.25,ROUND(AN114/AD114,0))","v":37},"/acre",null,null,null,null,null,3.5,3.68]
["Seeding Air_Drills_with_Independent_Opener Medium, 46-65 FT (requires 500 hp)","Seeding","Air_Drills_with_Independent_Opener","Medium, 46-65 FT (requires 500 hp)","46-65 FT",{"$f":"ROUND(G115/25000,0)*25000","v":750000},746208,"","John Deere","N560F 60 ft with  1910 550 bu cart",null,null,null,null,null,null,null,null,null,null,null,null,null,15,200,3.68,null,4.75,56,23," (acre/hr)",261.412987104477,{"$f":"Z115/100*F115/Y115","v":138},59.911948065671545,459,null,null,null,{"$f":"AN12","v":319},778,34,"/acre",null,null,null,null,null,3.5,3.68]
["Seeding Air_Drills_with_Independent_Opener Large, 66-86 FT (requires 550+ hp)","Seeding","Air_Drills_with_Independent_Opener","Large, 66-86 FT (requires 550+ hp)","66-86 FT",950000,1000000,"","John Deere","1870 wC850",null,null,null,null,null,null,null,null,null,null,null,null,null,15,200,3.68,null,4.75,75,30," (acre/hr)",331.1231169990042,174.8,75.888467549850631,582,null,null,null,{"$f":"AN13","v":351},933,31,"/acre",null,null,null,null,null,3.5,3.68]
["Seeding Air_Hoe_Drill Small, 27-50 FT (requires 350 hp)","Seeding","Air_Hoe_Drill","Small, 27-50 FT (requires 350 hp)","27-50 FT",300000,299649,"","New Holland","P2050 39' with P3440 435 bu air cart",null,null,null,"John Deere","H541 40ft with 1910  350 bu cart",null,null,null,null,null,null,null,null,15,200,3.15,null,4.75,40,16," (acre/hr)",104.5651948417908,{"$f":"Z117/100*F117/Y117","v":47.25},22.772279226268619,175,null,null,null,{"$f":"AN11","v":279},454,28,"/acre",null,null,null,null,null,3,3.15]
["Seeding Air_Hoe_Drill Large, 51-72 FT (requires 550+ hp)","Seeding","Air_Hoe_Drill","Large, 51-72 FT (requires 550+ hp)","51-72 FT",750000,767159,"","John Deere","H56160ft with 1910 cart 550 bu capacity",null,null,null,"New Holland","P2050 57' with P480 580bu cart",null,null,null,null,null,null,null,null,15,200,3.15,null,4.75,60,24," (acre/hr)",261.412987104477,{"$f":"Z118/100*F118/Y118","v":118.125},56.93069806567155,{"$f":"IF(AF118+AG118+AH118<10,ROUND((AF118+AG118+AH118)/0.25,0)*0.25,ROUND(AF118+AG118+AH118,0))","v":436},null,null,null,{"$f":"AN13","v":351},787,33,"/acre",null,null,null,null,null,3,3.15]
["Seeding Air_Disc_Drill Small, 30-49 FT (requires 450 hp)","Seeding","Air_Disc_Drill","Small, 30-49 FT (requires 450 hp)","30-49 FT",600000,604633.59999999998,"","New Holland","P2082 40' with P3440 440 bu air cart",null,null,null,"John deere","730 Level Lift double disk 44ft with 1910-350 bu cart",null,null,null,null,null,null,null,null,15,200,3.15,null,5.5,40,19," (acre/hr)",209.1303896835816,94.5,45.544558452537238,349,null,null,null,{"$f":"AN12","v":319},668,35,"/acre",null,null,null,null,null,3,3.15]
["Seeding Air_Disc_Drill Large, 50-70 FT (requires 550+ hp)","Seeding","Air_Disc_Drill","Large, 50-70 FT (requires 550+ hp)","50-70 FT",950000,1039521.6,"","Bourgault","3720 50'with 700 bu card/dual shoot",null,null,null,"John deere","1895 60' with C650 cart/dual shoot",null,null,null,"New Holland","P2082 60' with P4580 cart 580 bu",null,null,null,15,200,3.15,null,5.5,60,28," (acre/hr)",331.1231169990042,149.625,72.112217549850627,553,null,null,null,{"$f":"AN13","v":351},904,32,"/acre",null,null,null,null,null,3,3.15]
["Seeding Air_Seeder Small, 25-40 FT (requires 350 hp)","Seeding","Air_Seeder","Small, 25-40 FT (requires 350 hp)","25-40 FT",300000,299649,"","Extrapolation ","10% increase 20/21 Price",null,null,null,null,null,null,null,null,null,null,null,null,null,15,200,3.15,null,4.75,33,13," (acre/hr)",104.5651948417908,47.25,22.772279226268619,175,null,null,null,{"$f":"AN11","v":279},454,35,"/acre",null,null,null,null,null,3,3.15]
["Seeding Air_Seeder Medium, 41-59 FT (requires 450 hp)","Seeding","Air_Seeder","Medium, 41-59 FT (requires 450 hp)","41-59 FT",500000,514062,"","Extrapolation","10% increase 20/21 Price",null,null,null,null,null,null,null,null,null,null,null,null,null,15,200,3.15,null,4.75,50,20," (acre/hr)",174.275324736318,78.75,37.9537987104477,291,null,null,null,{"$f":"AN12","v":319},610,31,"/acre",null,null,null,null,null,3,3.15]
["Seeding Air_Seeder Large, 60-70 FT (requires 550+ hp)","Seeding","Air_Seeder","Large, 60-70 FT (requires 550+ hp)","60-70 FT",750000,767159,"","Extrapolation","10% increae 20/21 price",null,null,null,null,null,null,null,null,null,null,null,null,null,15,200,3.15,null,4.75,65,26," (acre/hr)",261.412987104477,118.125,56.93069806567155,436,null,null,null,{"$f":"AN13","v":351},787,30,"/acre",null,null,null,null,null,3,3.15]
["Seeding Row_Crop_Planter 12 row planter (requires 150 hp)","Seeding","Row_Crop_Planter","12 row planter (requires 150 hp)","12 row planter",{"$f":"ROUND(G124/10000,0)*10000","v":170000},171286,"","John Deere","1775 Flex planter 12 row -30in ",null,null,null,"Case IH","ER 1245 Planter 12Row 30\" ",null,null,null,null,null,null,null,null,10,100,4.2,null,5,30,13," (acre/hr)",{"$f":"(F124*Fraction_dep_over_optimal_life/X124/Y124)+IF(Machinery_Financed_percentage=0,0,(-CUMIPMT(Interest_Rate/2,Payback_loan_period_years*2,F124*Machinery_Financed_percentage,1,Payback_loan_period_years*2,0)/X124/Y124))+((F124*(1-Machinery_Financed_percentage)*(1+Opportunity_Rate/12)^(Opp_inv_period_years*12)-(F124*(1-Machinery_Financed_percentage)))/X124/Y124)+(Insurance_and_Housing*F124/Y124)","v":169.26083123104436},{"$f":"Z124/100*F124/Y124","v":71.400000000000006},{"$f":"Margin_percentage*(AF124+AG124)","v":36.099124684656651},277,null,null,null,{"$f":"AN8","v":135},412,32,"/acre",null,null,null,null,null,4,4.2]
["Seeding Row_Crop_Planter 16 row planter (requires 180 hp)","Seeding","Row_Crop_Planter","16 row planter (requires 180 hp)","16 row planter",{"$f":"ROUND(G125/10000,0)*10000","v":280000},278240,{"$f":"IFERROR(AVERAGE(M125,R125,W125),\"\")","v":""},"John Deere","1775NT Planter 16 row 30 in",null,null,null,"Case IH","ER 1245 Planter 16 Row 30\" spacing",null,null,null,null,null,null,null,null,10,100,4.2,null,5,40,17," (acre/hr)",278.7825455570142,117.6,59.45738183355212,456,null,null,null,{"$f":"AN9","v":176},632,37,"/acre",null,null,null,null,null,4,4.2]
["Seeding Row_Crop_Planter 24 row planter (requires 230 hp)","Seeding","Row_Crop_Planter","24 row planter (requires 230 hp)","24 row planter",420000,421903,null,"John Deere","1775NT Planter 24 row 30 in no options",null,null,null,"Case IH","ER 1245 Planter 24 rows 20\" spcaing",null,null,null,null,null,null,null,null,10,100,4.2,null,5,60,25," (acre/hr)",418.17381833552139,176.4,89.186072750328208,684,null,null,null,{"$f":"AN10","v":213},897,36,"/acre",null,null,null,null,null,4,4.2]
["Seeding Row_Crop_Planter 12/24 split row planter (requires 210 hp)","Seeding","Row_Crop_Planter","12/24 split row planter (requires 210 hp)","12/24 split row planter",320000,317466,null,"John Deere","1795 12 Row Split 24 Row Planter no options",null,null,null,"Case IH","ER 1240 Pivot Transport 12/24 split row",null,null,null,null,null,null,null,null,10,100,4.2,null,7.5,30,19," (acre/hr)",318.60862349373048,134.4,67.951293524059579,521,null,null,null,{"$f":"AN9","v":176},697,37,"/acre",null,null,null,null,null,4,4.2]
["Seeding Row_Crop_Planter 16/32 split row planter (requires 250 hp)","Seeding","Row_Crop_Planter","16/32 split row planter (requires 250 hp)","16/32 split row planter",390000,390566,null,"John Deere","1775 NT 16 row 32\" row spacing",null,null,null,"Case IH","ER 240 Pivot Transport16/32 Row",null,null,null,null,null,null,null,null,10,100,4.2,null,7.5,40,25," (acre/hr)",388.30425988298413,163.80000000000001,82.815638982447624,635,null,null,null,{"$f":"AN10","v":213},848,34,"/acre",null,null,null,null,null,4,4.2]
["Soil_Preparation Cultivator_Field_with_tine_harrows Small, 24-35 FT (requires 225+ hp)","Soil_Preparation","Cultivator_Field_with_tine_harrows","Small, 24-35 FT (requires 225+ hp)","24-35 FT",100000,100000,"","John Deere","2230 LL 33 ft",null,null,null,"Case IH","Vibra-Tine 28.5 ft",null,null,null,"new Holland","ST 830",null,null,null,20,200,1.58,null,5,30,{"$f":"ROUND((AB129*5280*AC129*Field_efficiency)/43560,0)","v":15}," (acre/hr)",27.3912987104477,{"$f":"Z129/100*F129/Y129","v":7.9000000000000012},5.2936948065671547,41,null,null,null,{"$f":"AN10","v":213},254,17,"/acre",null,null,null,null,null,1.5,1.58]
[{"$f":"B130&\" \"&C130&\" \"&D130","v":"Soil_Preparation Cultivator_Field_with_tine_harrows Medium, 36-49 FT (requires 400 hp)"},"Soil_Preparation","Cultivator_Field_with_tine_harrows","Medium, 36-49 FT (requires 400 hp)","36-49 FT",130000,130000,"","John Deere","2230 LL 42 ft",null,null,null,"Case IH","Vibra-Tine 48.5 ft",null,null,null,"new Holland","ST 830",null,null,null,20,200,1.58,null,5,43,21," (acre/hr)",35.608688323582001,{"$f":"Z130/100*F130/Y130","v":10.27},6.8818032485372997,53,null,null,null,{"$f":"AN11","v":279},332,16,"/acre",null,null,null,null,null,1.5,1.58]
["Soil_Preparation Cultivator_Field_with_tine_harrows Large, 50-62 FT (requires 500 hp)","Soil_Preparation","Cultivator_Field_with_tine_harrows","Large, 50-62 FT (requires 500 hp)","50-62 FT",175000,175000,null,"New HOlland","ST 830 ",null,null,null,"John Deere","2230 LL 60ft",null,null,null,null,null,null,null,null,20,200,1.58,null,5,56,27," (acre/hr)",47.934772743283474,13.825000000000003,9.2639659114925212,71,null,null,null,{"$f":"AN12","v":319},390,14,"/acre",null,null,null,null,null,1.5,1.58]
["Soil_Preparation Cultivator_Heavy_Duty_with_tine_harrows Small, 23-40 FT (requires 400 hp)","Soil_Preparation","Cultivator_Heavy_Duty_with_tine_harrows","Small, 23-40 FT (requires 400 hp)","23-40 FT",125000,125000,"","Case IH","Flex Till 600 Chisel",null,null,null,"John Deere","2430 Cshank 35ft",null,null,null,null,null,null,null,null,20,200,1.58,null,5,31,15," (acre/hr)",34.239123388059625,{"$f":"Z132/100*F132/Y132","v":9.8750000000000018},6.6171185082089439,51,null,null,null,{"$f":"AN11","v":279},330,22,"/acre",null,null,null,null,null,1.5,1.58]
["Soil_Preparation Cultivator_Heavy_Duty_with_tine_harrows Medium, 41-50 FT (requires 500 hp)","Soil_Preparation","Cultivator_Heavy_Duty_with_tine_harrows","Medium, 41-50 FT (requires 500 hp)","41-50 FT",150000,150000,null,"Case IH","Flex Till 600 Chisel 48.8ft",null,null,null,"John Deere","2430 Cshank45ft",null,null,null,null,null,null,null,null,20,200,1.58,null,5,45,22," (acre/hr)",41.08694806567155,{"$f":"Z133/100*F133/Y133","v":11.850000000000001},7.9405422098507321,61,null,null,null,{"$f":"AN12","v":319},380,17,"/acre",null,null,null,null,null,1.5,1.58]
["Soil_Preparation Cultivator_Heavy_Duty_with_tine_harrows Large, 51-62 FT (requires 550+ hp)","Soil_Preparation","Cultivator_Heavy_Duty_with_tine_harrows","Large, 51-62 FT (requires 550+ hp)","51-62 FT",200000,200000,null,"Bourgault","9500 60'",null,null,null,"Bourgault","9500 70'",null,null,null,"John Deere","2430 60 ft",null,null,null,20,200,1.58,null,5,56,27," (acre/hr)",54.782597420895399,15.800000000000002,10.587389613134309,81,null,null,null,{"$f":"AN13","v":351},432,16,"/acre",null,null,null,null,null,1.5,{"$f":"ROUND((AV134*$AW$2)+AV134,2)","v":1.58}]
["Soil_Preparation Harrow_Mid 60-90 FT (requires 400 hp)","Soil_Preparation","Harrow_Mid","60-90 FT (requires 400 hp)","60-90 FT",100000,100000,null,"Elmers","Super 7 70'",null,null,null,"Riteway","7200 Harrow 82ft",null,null,null,null,null,null,null,null,25,75,1.26,null,7.5,70,51," (acre/hr)",61.101437248955094,{"$f":"Z135/100*F135/Y135","v":16.8},11.685215587343263,90,null,null,null,{"$f":"AN11","v":279},369,7.25,"/acre",null,null,null,null,null,1.2,1.26]
["Soil_Preparation Harrow_Heavy 60-90 FT (requires 550+ hp)","Soil_Preparation","Harrow_Heavy","60-90 FT (requires 550+ hp)","60-90 FT",125000,125000,null,"Bourgault","XR 771-90'",null,null,null,"Bourgault","XR 771-70'",null,null,null,"Riteway","HH 8250 NT",null,null,null,20,100,1.58,null,7.5,70,51," (acre/hr)",68.478246776119249,19.750000000000004,13.234237016417888,101,null,null,null,{"$f":"AN13","v":351},452,8.75,"/acre",null,null,null,null,null,1.5,1.58]
["Soil_Preparation Harrow_Packer 25-62 FT (requires 175 hp)","Soil_Preparation","Harrow_Packer","25-62 FT (requires 175 hp)","25-62 FT",{"$f":"ROUND(G137,-3)","v":50000},50000,"","Extrapolation","10% increase 20/21 Price",null,null,null,null,null,null,null,null,null,null,null,null,null,25,200,0.53,null,7.5,44,32," (acre/hr)",11.456519484179079,1.325,1.9172279226268616,15,null,null,null,{"$f":"AN9","v":176},191,6,"/acre",null,null,null,null,null,0.5,0.53]
["Soil_Preparation Vertical_Tillage_Tools_Compact Small, 10-30 FT (requires 400 hp)","Soil_Preparation","Vertical_Tillage_Tools_Compact","Small, 10-30 FT (requires 400 hp)","10-30 FT",100000,{"$f":"85000*1.2","v":102000},null,"Kongskilde","9125 Vertical Tillage",null,null,null,"Salford","I-1224",null,null,null,"Lemken","Heliodor 9/700",null,null,null,20,100,3.68,null,8,20,16," (acre/hr)",54.782597420895399,{"$f":"Z138/100*F138/Y138","v":36.799999999999997},13.73738961313431,105,null,null,null,{"$f":"AN11","v":279},384,24,"/acre",null,null,null,null,null,3.5,3.68]
["Soil_Preparation Vertical_Tillage_Tools_Compact Large, 31-50 FT (requires 550+ hp)","Soil_Preparation","Vertical_Tillage_Tools_Compact","Large, 31-50 FT (requires 550+ hp)","31-50 FT",150000,150000,"","Viking ","Viking VT 37'",null,null,null,null,null,null,null,null,null,null,null,null,null,20,100,3.68,null,8,40,31," (acre/hr)",82.173896131343099,{"$f":"Z139/100*F139/Y139","v":55.2},20.606084419701464,158,null,null,null,{"$f":"AN13","v":351},509,16,"/acre",null,null,null,null,null,3.5,3.68]
["Soil_Preparation Vertical_Tillage_Tools_Heavy_Duty Small, 10-25 FT (requires 500 hp)","Soil_Preparation","Vertical_Tillage_Tools_Heavy_Duty","Small, 10-25 FT (requires 500 hp)","10-25 FT",145000,{"$f":"100000*1.43","v":143000},"","Mandako","Storm 20",null,null,null,"Degelman ","ProTill 20ft",null,null,null,"Salford","5200 Enforcer 16ft",null,null,null,20,100,3.68,null,8,18,14," (acre/hr)",79.434766260298332,53.36,19.91921493904475,153,null,null,null,{"$f":"AN12","v":319},472,34,"/acre",null,null,null,null,null,3.5,3.68]
["Soil_Preparation Vertical_Tillage_Tools_Heavy_Duty Large, 26-40 FT (requires 550+ hp)","Soil_Preparation","Vertical_Tillage_Tools_Heavy_Duty","Large, 26-40 FT (requires 550+ hp)","26-40 FT",250000,250000,null,"Degelman ","Protill 41ft",null,null,null,"Degelman ","ProTill 35ft",null,null,null,"Degelman","ProTill 45ft",null,null,null,20,100,3.68,null,8,33,26," (acre/hr)",136.9564935522385,92,34.343474032835772,263,null,null,null,{"$f":"AN13","v":351},614,24,"/acre",null,null,null,null,null,3.5,3.68]
["Soil_Preparation Land_Roller 20 FT (fixed) (requires 100 hp)","Soil_Preparation","Land_Roller","20 FT (fixed) (requires 100 hp)","20 FT (Fixed)",{"$f":"ROUND(G142,-3)","v":30000},30000,null,"Mandako","L205001",null,null,null,"Riteway","F3-32",null,null,null,null,null,null,null,null,20,75,1.05,null,6,16,9," (acre/hr)",21.913038968358158,{"$f":"Z142/100*F142/Y142","v":4.2},3.9169558452537236,30,null,null,null,{"$f":"AN8","v":135},165,18,"/acre",null,null,null,null,null,1,1.05]
["Soil_Preparation Land_Roller 40-50 FT (3 sections) (requires 225+ hp)","Soil_Preparation","Land_Roller","40-50 FT (3 sections) (requires 225+ hp)","40-50 FT\n(3 section)",75000,75000,null,"Mandako","5 section",null,null,null,"Riteway ","F5-62",null,null,null,"Mandako","50 ft roller",null,null,null,20,75,1.05,null,6,45,26," (acre/hr)",54.782597420895399,{"$f":"Z143/100*F143/Y143","v":10.5},9.7923896131343096,75,null,null,null,{"$f":"AN10","v":213},288,11,"/acre",null,null,null,null,null,1,1.05]
["Soil_Preparation Land_Roller 55-75 FT (5 sections) (requires 400 hp)","Soil_Preparation","Land_Roller","55-75 FT (5 sections) (requires 400 hp)","55-75 FT\n(5 section)",110000,110000,null,"Extrapolation ","10% increase over 20/21",null,null,null,null,null,null,null,null,null,null,null,null,null,20,75,1.05,null,6,65,38," (acre/hr)",80.347809550646588,15.4,14.362171432596989,110,null,null,null,{"$f":"AN11","v":279},389,10,"/acre",null,null,null,null,null,1,1.05]
[{"$f":"B145&\" \"&C145&\" \"&D145","v":"Soil_Preparation Land_Scraper 10.0-15.0 CU. yard (requires 400 hp)"},"Soil_Preparation","Land_Scraper","10.0-15.0 CU. yard (requires 400 hp)","10.0-15.0 CU. yard",75000,75000,"","Ashland","1410E Direct Mount Ejector Scraper",null,null,null,"Leon","M1000A Scraper",null,null,null,null,null,null,null,null,10,80,2.63,null,null,null,null,null,93.342370164178874,{"$f":"Z145/100*F145/Y145","v":24.65625},17.699793024626832,136,null,null,null,{"$f":"AN11","v":279},415,null,null,null,null,null,null,null,2.5,2.63]
["Soil_Preparation Land_Scraper 15.0+ CU. yard (requires 550 hp)","Soil_Preparation","Land_Scraper","15.0+ CU. yard (requires 550 hp)","15.0+ CU. yard",125000,125000,"","Leon",2050,null,null,null,"Leon","M1700",null,null,null,"Leon",1350,null,null,null,10,80,2.63,null,null,null,null,null,155.57061694029815,{"$f":"Z146/100*F146/Y146","v":41.09375},29.499655041044722,226,null,null,null,{"$f":"AN13","v":351},577,null,null,null,null,null,null,null,2.5,2.63]
["Soil_Preparation Land_Scraper Pull Dozer 15.0-20.0 CU. yard (requires 400 hp)","Soil_Preparation","Land_Scraper","Pull Dozer 15.0-20.0 CU. yard (requires 400 hp)","Pull Dozer\n15.0-20.0 CU. yard",100000,100000,"","Bridgeview Manufacturing","Pulldozer 1810",null,null,null,"Bridgeview Manufacturing ","Pulldozer 1870 transformer",null,null,null,null,null,null,null,null,10,80,2.63,null,null,null,null,null,124.45649355223848,32.875,23.599724032835773,181,null,null,null,{"$f":"AN11","v":279},{"$f":"IF(AI147+AJ147+AK147+AL147+AM147<10,ROUND((AI147+AJ147+AK147+AL147+AM147)/0.25,0)*0.25,ROUND(AI147+AJ147+AK147+AL147+AM147,0))","v":460},null,null,null,null,null,null,null,2.5,2.63]
["Soil_Preparation Land_Scraper Pull Dozer 21.0+ CU. yard (requires 550 hp)","Soil_Preparation","Land_Scraper","Pull Dozer 21.0+ CU. yard (requires 550 hp)","Pull Dozer\n 21.0+ CU. yard",150000,150000,"","Bridgeview Manufacturing","Pulldozer 2410 ",null,null,null,"Bridgeview Manufacturing ","Pulldozer 2470 transformer",null,null,null,null,null,null,null,null,10,80,2.63,null,null,null,null,null,186.68474032835775,49.3125,35.399586049253664,271,null,null,null,{"$f":"AN13","v":351},622,null,null,null,null,null,null,null,2.5,2.63]
["Soil_Preparation Land_Scraper Rotary Ditcher (requires 400 hp)","Soil_Preparation","Land_Scraper","Rotary Ditcher (requires 400 hp)","Rotary Ditcher",100000,100000,"","Wolverine","Rotary Ditcher",null,null,null,"Crary","Revolution Ditcher",null,null,null,null,null,null,null,null,10,80,2.63,null,null,null,null,null,124.45649355223848,32.875,23.599724032835773,181,null,null,null,{"$f":"AN11","v":279},460,null,null,null,null,null,null,null,2.5,2.63]
["Soil_Preparation Anhydrous_Ammonia_Applicator_Add_On 30-60 FT (less tillage tool, nurse tank & trailer)","Soil_Preparation","Anhydrous_Ammonia_Applicator_Add_On","30-60 FT (less tillage tool, nurse tank & trailer)","30-60 FT",{"$f":"ROUND(G150,-3)","v":30000},30000,null,"Extrapolation","10% increase over 20/21",null,null,null,null,null,null,null,null,null,null,null,null,null,15,200,2.1,null,null,null,null,null,10.456519484179079,{"$f":"Z150/100*F150/Y150","v":3.15},{"$f":"Margin_percentage*(AF150+AG150)","v":2.0409779226268618},16,null,null,null,null,null,null,null,null,null,null,null,null,2,2.1]
["Soil_Preparation Liquid_Fertilizer_Applicator_Add_On 25-40 FT (1600-1800 gal. tank & cart, less tillage tool)","Soil_Preparation","Liquid_Fertilizer_Applicator_Add_On","25-40 FT (1600-1800 gal. tank & cart, less tillage tool)","25-40 FT, 1600-1800 gal.tank",{"$f":"ROUND(G151,-3)","v":50000},50000,null,"Extrapolation","10% increase over 20/22",null,null,null,null,null,null,null,null,null,null,null,null,null,15,200,2.1,null,null,null,null,null,17.4275324736318,5.25,3.4016298710447699,26,null,null,null,null,null,null,null,null,null,null,null,null,2,2.1]
["Soil_Preparation Liquid_Fertilizer_Applicator_Add_On 40-60 FT (2400-3200 gal. tank & cart, less tillage tool)","Soil_Preparation","Liquid_Fertilizer_Applicator_Add_On","40-60 FT (2400-3200 gal. tank & cart, less tillage tool)","40-60 FT, 2400-3200 gal.tank",75000,75000,null,"Extrapolation","10% increase over 20/23",null,null,null,null,null,null,null,null,null,null,null,null,null,15,200,2.1,null,null,null,null,null,26.1412987104477,7.875,5.1024448065671546,39,null,null,null,null,null,null,null,null,null,null,null,null,2,2.1]
["Soil_Preparation Liquid_Fertilizer_Applicator_Add_On 60-75 FT (4300 gal. tank & cart, less tillage tool)","Soil_Preparation","Liquid_Fertilizer_Applicator_Add_On","60-75 FT (4300 gal. tank & cart, less tillage tool)","60-75 FT, 4300 gal.tank",{"$f":"ROUND(G153/5000,0)*5000","v":125000},125000,null,"Extrapolation","10% increase over 20/24",null,null,null,null,null,null,null,null,null,null,null,null,null,15,200,2.1,null,null,null,null,null,43.5688311840795,13.125,8.5040746776119249,65,null,null,null,null,null,null,null,null,null,null,null,null,2,2.1]
["Soil_Preparation Granular_Fertilizer_Applicator 6-10 ton, spin 40 FT (requires 100hp)","Soil_Preparation","Granular_Fertilizer_Applicator","6-10 ton, spin 40 FT (requires 100hp)","6-10 ton, spin 40 FT ",45000,{"$f":"35000*1.25","v":43750},null,"Extrapolation","10% increase over 20/25",null,null,null,null,null,null,null,null,null,null,null,null,null,20,100,1.58,null,5,40,{"$f":"ROUND((AB154*5280*AC154*Field_efficiency)/43560,0)","v":19}," (acre/hr)",{"$f":"(F154*Fraction_dep_over_optimal_life/X154/Y154)+IF(Machinery_Financed_percentage=0,0,(-CUMIPMT(Interest_Rate/2,Payback_loan_period_years*2,F154*Machinery_Financed_percentage,1,Payback_loan_period_years*2,0)/X154/Y154))+((F154*(1-Machinery_Financed_percentage)*(1+Opportunity_Rate/12)^(Opp_inv_period_years*12)-(F154*(1-Machinery_Financed_percentage)))/X154/Y154)+(Insurance_and_Housing*F154/Y154)","v":24.652168839402929},{"$f":"Z154/100*F154/Y154","v":7.1100000000000012},{"$f":"Margin_percentage*(AF154+AG154)","v":4.7643253259104394},37,null,null,null,{"$f":"AN6","v":116},{"$f":"IF(AI154+AJ154+AK154+AL154+AM154<10,ROUND((AI154+AJ154+AK154+AL154+AM154)/0.25,0)*0.25,ROUND(AI154+AJ154+AK154+AL154+AM154,0))","v":153},{"$f":"IF(AN154/AD154<10,ROUND((AN154/AD154)/0.25,0)*0.25,ROUND(AN154/AD154,0))","v":8},"/acre",null,null,null,null,null,1.5,1.58]
["Soil_Preparation Granular_Fertilizer_Applicator 10-12 ton, boom 60 FT (requires 225+hp)","Soil_Preparation","Granular_Fertilizer_Applicator","10-12 ton, boom 60 FT (requires 225+hp)","10-12 ton, boom 60 FT",175000,175000,null,"Extrapolation","10% increase over 20/26",null,null,null,null,null,null,null,null,null,null,null,null,null,20,100,3.58,null,6,60,35," (acre/hr)",95.869545486566949,62.65,23.777931822985042,182,null,null,null,{"$f":"AN10","v":213},395,11,"/acre",null,null,null,null,null,1.5,1.58]
["Soil_Preparation Discs_Heavy_Offset Small, 10-12 FT (requires 105 hp)","Soil_Preparation","Discs_Heavy_Offset","Small, 10-12 FT (requires 105 hp)",null,50000,50000,null,"Extrapolation","10% increase over 20/27",null,null,null,null,null,null,null,null,null,null,null,null,null,20,50,3.15,null,6,10,{"$f":"ROUND((AB156*5280*AC156*Field_efficiency)/43560,0)","v":6}," (acre/hr)",{"$f":"(F156*Fraction_dep_over_optimal_life/X156/Y156)+IF(Machinery_Financed_percentage=0,0,(-CUMIPMT(Interest_Rate/2,Payback_loan_period_years*2,F156*Machinery_Financed_percentage,1,Payback_loan_period_years*2,0)/X156/Y156))+((F156*(1-Machinery_Financed_percentage)*(1+Opportunity_Rate/12)^(Opp_inv_period_years*12)-(F156*(1-Machinery_Financed_percentage)))/X156/Y156)+(Insurance_and_Housing*F156/Y156)","v":54.782597420895399},{"$f":"Z156/100*F156/Y156","v":31.5},{"$f":"Margin_percentage*(AF156+AG156)","v":12.94238961313431},99,null,null,null,{"$f":"AN7","v":127},226,38,"/acre",null,null,null,null,null,3,3.15]
["Soil_Preparation Discs_Heavy_Offset Medium, 14-16 FT (requires 150 hp)","Soil_Preparation","Discs_Heavy_Offset","Medium, 14-16 FT (requires 150 hp)",null,{"$f":"ROUND(G157/5000,0)*5000","v":60000},60000,null,"Extrapolation","10% increase over 20/28",null,null,null,null,null,null,null,null,null,null,null,null,null,20,50,3.15,null,6,14,8," (acre/hr)",65.739116905074468,37.799999999999997,15.530867535761169,119,null,null,null,{"$f":"AN8","v":135},254,32,"/acre",null,null,null,null,null,3,3.15]
["Soil_Preparation Discs_Heavy_Offset Large, 17-20 FT (requires 180 hp)","Soil_Preparation","Discs_Heavy_Offset","Large, 17-20 FT (requires 180 hp)",null,70000,70000,null,"Extrapolation","10% increase over 20/29",null,null,null,null,null,null,null,null,null,null,null,null,null,20,50,3.15,null,5,17,8," (acre/hr)",76.695636389253551,44.1,18.119345458388032,139,null,null,null,{"$f":"AN8","v":135},274,34,"/acre",null,null,null,null,null,3,3.15]
["Soil_Preparation Discs_Heavy_Tandem Small, 24-30 FT (requires 180 hp)","Soil_Preparation","Discs_Heavy_Tandem","Small, 24-30 FT (requires 180 hp)",null,100000,100000,null,"Extrapolation","10% increase over 20/30",null,null,null,null,null,null,null,null,null,null,null,null,null,20,150,3.15,null,5.5,24,{"$f":"ROUND((AB159*5280*AC159*Field_efficiency)/43560,0)","v":13}," (acre/hr)",{"$f":"(F159*Fraction_dep_over_optimal_life/X159/Y159)+IF(Machinery_Financed_percentage=0,0,(-CUMIPMT(Interest_Rate/2,Payback_loan_period_years*2,F159*Machinery_Financed_percentage,1,Payback_loan_period_years*2,0)/X159/Y159))+((F159*(1-Machinery_Financed_percentage)*(1+Opportunity_Rate/12)^(Opp_inv_period_years*12)-(F159*(1-Machinery_Financed_percentage)))/X159/Y159)+(Insurance_and_Housing*F159/Y159)","v":36.521731613930264},{"$f":"Z159/100*F159/Y159","v":21},{"$f":"Margin_percentage*(AF159+AG159)","v":8.6282597420895399},66,null,null,null,{"$f":"AN9","v":176},242,19,"/acre",null,null,null,null,null,3,3.15]
["Soil_Preparation Discs_Heavy_Tandem Medium, 31-35 FT (requires 210 hp)","Soil_Preparation","Discs_Heavy_Tandem","Medium, 31-35 FT (requires 210 hp)",null,125000,125000,null,"Extrapolation","10% increase over 20/31",null,null,null,null,null,null,null,null,null,null,null,null,null,20,150,3.15,null,5.5,31,17," (acre/hr)",45.652164517412842,26.25,10.785324677611927,83,null,null,null,{"$f":"AN10","v":213},296,17,"/acre",null,null,null,null,null,3,3.15]
["Soil_Preparation Discs_Heavy_Tandem Large, 36-42 FT (requires 250 hp)","Soil_Preparation","Discs_Heavy_Tandem","Large, 36-42 FT (requires 250 hp)",null,150000,150000,null,"Extrapolation","10% increase over 20/22",null,null,null,null,null,null,null,null,null,null,null,null,null,20,150,3.15,null,5.5,36,19," (acre/hr)",54.782597420895399,31.5,12.94238961313431,99,null,null,null,{"$f":"AN11","v":279},378,20,"/acre",null,null,null,null,null,3,3.15]
["Soil_Preparation Rock_Windower_Rake 12-14 FT (requires 50 hp)","Soil_Preparation","Rock_Windower_Rake","12-14 FT (requires 50 hp)",null,{"$f":"ROUND(G162,-3)","v":30000},30000,null,"Extrapolation","10% increase over 20/22",null,null,null,null,null,null,null,null,null,null,null,null,null,20,50,1.05,null,6.5,12,{"$f":"ROUND((AB162*5280*AC162*Field_efficiency)/43560,0)","v":8}," (acre/hr)",{"$f":"(F162*Fraction_dep_over_optimal_life/X162/Y162)+IF(Machinery_Financed_percentage=0,0,(-CUMIPMT(Interest_Rate/2,Payback_loan_period_years*2,F162*Machinery_Financed_percentage,1,Payback_loan_period_years*2,0)/X162/Y162))+((F162*(1-Machinery_Financed_percentage)*(1+Opportunity_Rate/12)^(Opp_inv_period_years*12)-(F162*(1-Machinery_Financed_percentage)))/X162/Y162)+(Insurance_and_Housing*F162/Y162)","v":32.869558452537234},{"$f":"Z162/100*F162/Y162","v":6.3},{"$f":"Margin_percentage*(AF162+AG162)","v":5.8754337678805841},45,null,null,null,{"$f":"AN6","v":116},161,20,"/acre",null,null,null,null,null,1,1.05]
["Soil_Preparation Rock_Picker 1.5-2.5 CU. yard (requires 75 hp)","Soil_Preparation","Rock_Picker","1.5-2.5 CU. yard (requires 75 hp)","1.5-2.5 CU. yard",35000,35000,null,"Extrapolation","10% increase over 20/22",null,null,null,null,null,null,null,null,null,null,null,null,null,25,50,1.05,null,null,null,null,null,32.07825455570142,7.35,5.9142381833552129,45,null,null,null,{"$f":"AN6","v":116},161,null,null,null,null,null,null,null,1,1.05]
["Soil_Preparation Rock_Picker 3.0-3.3 CU. yard (requires 85 hp)","Soil_Preparation","Rock_Picker","3.0-3.3 CU. yard (requires 85 hp)","3.0-3.3 CU. yard",50000,50000,null,"Extrapolation","10% increase over 20/22",null,null,null,null,null,null,null,null,null,null,null,null,null,25,50,1.05,null,null,null,null,null,45.826077936716317,10.5,8.4489116905074475,65,null,null,null,{"$f":"AN6","v":116},181,null,null,null,null,null,null,null,1,1.05]
["Sprayers High_Clearance_Sprayer 800 US gal, 90 FT boom","Sprayers","High_Clearance_Sprayer","800 US gal, 90 FT boom",null,{"$f":"ROUNDUP(G165/25000,0)*25000","v":475000},461861,{"$f":"IFERROR(AVERAGE(L165,Q165,V165),\"\")","v":""},"Rogator","RG900C",null,null,null,"John Deere","R4030",null,null,null,"Case IH",3240,null,null,null,8,175,3.68,41,10,90,{"$f":"ROUND((AB165*5280*AC165*Field_efficiency*0.8)/43560,0)","v":70}," (acre/hr)",331.02476821321881,99.885714285714286,64.636572374839957,496,{"$f":"AA165*Fuel_Price","v":57.4},{"$f":"Labour","v":27},{"$f":"Margin_percentage*(AJ165+AK165)","v":12.66},null,593,{"$f":"IF(AN165/AD165<10,ROUND((AN165/AD165)/0.25,0)*0.25,ROUND(AN165/AD165,0))","v":8.5},"/acre",null,null,null,null,null,3.5,3.68]
["Sprayers High_Clearance_Sprayer 1000 US gal, 100 FT boom","Sprayers","High_Clearance_Sprayer","1000 US gal, 100 FT boom",null,{"$f":"ROUNDUP(G166/25000,0)*25000","v":575000},567635,{"$f":"IFERROR(AVERAGE(L166,Q166,V166),\"\")","v":""},"Rogator","RG 1100C",null,null,null,"John Deere","R4038",null,null,null,"John Deere","Hagie STS10",null,null,null,8,175,3.68,52,10,100,{"$f":"ROUND((AB166*5280*AC166*Field_efficiency*0.8)/43560,0)","v":78}," (acre/hr)",400.71419310021219,{"$f":"Z166/100*F166/Y166","v":120.91428571428571},78.244271822174667,600,{"$f":"AA166*Fuel_Price","v":72.8},{"$f":"Labour","v":27},{"$f":"Margin_percentage*(AJ166+AK166)","v":14.969999999999999},null,715,9.25,"/acre",null,null,null,null,null,3.5,3.68]
["Sprayers High_Clearance_Sprayer 1200 US gal, 120 FT boom","Sprayers","High_Clearance_Sprayer","1200 US gal, 120 FT boom",null,{"$f":"ROUNDUP(G167/25000,0)*25000","v":675000},664498,"","Rogator","RG 1300C",null,null,null,"John Deere","R4045",null,null,null,"John Deere","Hagie STS12",null,null,null,8,175,3.68,61,10,120,{"$f":"ROUND((AB167*5280*AC167*Field_efficiency*0.8)/43560,0)","v":93}," (acre/hr)",470.40361798720562,141.94285714285715,91.85197126950942,704,{"$f":"AA167*Fuel_Price","v":85.399999999999991},{"$f":"Labour","v":27},{"$f":"Margin_percentage*(AJ167+AK167)","v":16.86},null,833,9,"/acre",null,null,null,null,null,3.5,3.68]
["Sprayers High_Clearance_Sprayer 1600 US gal, 130 FT boom","Sprayers","High_Clearance_Sprayer","1600 US gal, 130 FT boom",null,{"$f":"ROUNDUP(G168/25000,0)*25000","v":725000},723543,"","Case IH","4400 (1600)",null,null,null,"John Deere","R4060",null,null,null,"John Deere","Hagie STS16",null,null,null,8,175,3.68,70,10,130,{"$f":"ROUND((AB168*5280*AC168*Field_efficiency*0.8)/43560,0)","v":101}," (acre/hr)",505.24833043070242,152.45714285714286,98.655820993176789,756,{"$f":"AA168*Fuel_Price","v":98},{"$f":"Labour","v":27},{"$f":"Margin_percentage*(AJ168+AK168)","v":18.75},null,900,9,"/acre",null,null,null,null,null,3.5,3.68]
["Miscellaneous Post_Pounder 3PT hitch (requires 55 hp)","Miscellaneous","Post_Pounder","3PT hitch (requires 55 hp)","3-point hitch mount",{"$f":"ROUND(G169/500,0)*500","v":10500},10500,{"$f":"IFERROR(AVERAGE(M169,R169,W169),\"\")","v":""},"Kencove ","PD100H",null,null,null,"Kiwi","Tractor mount post driver",null,null,null,"Vector ","Model 3 Post driver w rock spike",null,null,null,20,40,2.1,null,null,null,null,null,14.380431822985043,5.5125000000000002,2.9839397734477564,23,null,null,null,{"$f":"AN6","v":116},139,null,null,null,null,null,null,null,2,2.1]
["Miscellaneous Post_Pounder Trailer mounted with engine","Miscellaneous","Post_Pounder","Trailer mounted with engine","Trailer mounted \nwith engine",{"$f":"ROUND(G170,-3)","v":25000},25000,null,"Wheatheart","Renegade Trailer with 13HP ",null,null,null,null,null,null,null,null,null,null,null,null,null,20,40,2.1,null,null,null,null,null,34.239123388059625,{"$f":"Z170/100*F170/Y170","v":13.125},7.1046185082089437,54,null,null,null,{"$f":"AN6","v":116},170,null,null,null,null,null,null,null,2,2.1]
["Miscellaneous Post_Pounder Skidsteer Mount (requires 55 hp)","Miscellaneous","Post_Pounder","Skidsteer Mount (requires 55 hp)","Skid steer mounted",{"$f":"ROUND(G171/500,0)*500","v":12500},12500,null,"KIWI","Skid Steer",null,null,null,"Kencove","PD100(H)SS",null,null,0,"kencove","PD80HSS",null,null,null,20,40,2.1,null,null,null,null,null,{"$f":"(F171*Fraction_dep_over_optimal_life/X171/Y171)+IF(Machinery_Financed_percentage=0,0,(-CUMIPMT(Interest_Rate/2,Payback_loan_period_years*2,F171*Machinery_Financed_percentage,1,Payback_loan_period_years*2,0)/X171/Y171))+((F171*(1-Machinery_Financed_percentage)*(1+Opportunity_Rate/12)^(Opp_inv_period_years*12)-(F171*(1-Machinery_Financed_percentage)))/X171/Y171)+(Insurance_and_Housing*F171/Y171)","v":17.119561694029812},6.5625,{"$f":"Margin_percentage*(AF171+AG171)","v":3.5523092541044718},27,null,null,null,{"$f":"AN6","v":116},143,null,null,null,null,null,null,null,2,2.1]
["Miscellaneous Front_End_Loader For 100-159 hp tractor","Miscellaneous","Front_End_Loader","For 100-159 hp tractor",null,{"$f":"ROUND(G172,-3)","v":23000},22500,null,"Extrapolation","10% increase over 20/21",null,null,null,null,null,null,null,null,null,null,null,null,null,20,100,3.47,null,null,null,null,null,{"$f":"(F172*Fraction_dep_over_optimal_life/X172/Y172)+IF(Machinery_Financed_percentage=0,0,(-CUMIPMT(Interest_Rate/2,Payback_loan_period_years*2,F172*Machinery_Financed_percentage,1,Payback_loan_period_years*2,0)/X172/Y172))+((F172*(1-Machinery_Financed_percentage)*(1+Opportunity_Rate/12)^(Opp_inv_period_years*12)-(F172*(1-Machinery_Financed_percentage)))/X172/Y172)+(Insurance_and_Housing*F172/Y172)","v":12.59999740680594},{"$f":"Z172/100*F172/Y172","v":7.9809999999999999},{"$f":"Margin_percentage*(AF172+AG172)","v":3.0871496110208914},24,null,null,null,{"$f":"AN8","v":135},159,null,null,null,null,null,null,null,3.3,3.47]
["Miscellaneous Front_End_Loader For 160-224 hp tractor","Miscellaneous","Front_End_Loader","For 160-224 hp tractor",null,25000,25000,null,"Extrapolation","10% increase over 20/21",null,null,null,null,null,null,null,null,null,null,null,null,null,20,100,3.47,null,null,null,null,null,13.69564935522385,8.6750000000000007,3.3555974032835776,26,null,null,null,{"$f":"AN9","v":176},202,null,null,null,null,null,null,null,3.3,3.47]
["Miscellaneous Snowblower Rear mount, 80-89 in. (requires 70 hp)","Miscellaneous","Snowblower","Rear mount, 80-89 in. (requires 70 hp)","Rear mount, \n80-89 inch",9000,{"$f":"11295-2500","v":8795},null,null,"10% increase over 20/21",null,null,null,null,null,null,null,null,null,null,null,null,null,20,50,1.05,null,null,null,null,null,9.860867535761173,1.89,1.762630130364176,14,null,null,null,{"$f":"AN8","v":135},149,null,null,null,null,null,null,null,1,1.05]
["Miscellaneous Snowblower Rear mount, 96 in. (requires 110 hp)","Miscellaneous","Snowblower","Rear mount, 96 in. (requires 110 hp)","Rear mount, \n96 inch",11000,11295,null,null,"10% increase over 20/21",null,null,null,null,null,null,null,null,null,null,null,null,null,20,50,1.05,null,null,null,null,null,12.052171432596989,2.3100000000000005,2.1543257148895485,17,null,null,null,{"$f":"AN8","v":135},152,null,null,null,null,null,null,null,1,1.05]
["Miscellaneous Snowblower Rear mount, 108 in. (requires 130 hp)","Miscellaneous","Snowblower","Rear mount, 108 in. (requires 130 hp)","Rear mount, \n108 inch",17000,16595,null,null,null,null,null,null,null,null,null,null,null,null,null,null,null,null,20,50,1.05,null,null,null,null,null,{"$f":"(F176*Fraction_dep_over_optimal_life/X176/Y176)+IF(Machinery_Financed_percentage=0,0,(-CUMIPMT(Interest_Rate/2,Payback_loan_period_years*2,F176*Machinery_Financed_percentage,1,Payback_loan_period_years*2,0)/X176/Y176))+((F176*(1-Machinery_Financed_percentage)*(1+Opportunity_Rate/12)^(Opp_inv_period_years*12)-(F176*(1-Machinery_Financed_percentage)))/X176/Y176)+(Insurance_and_Housing*F176/Y176)","v":18.626083123104433},{"$f":"Z176/100*F176/Y176","v":3.57},{"$f":"Margin_percentage*(AF176+AG176)","v":3.329412468465665},26,null,null,null,{"$f":"AN8","v":135},161,null,null,null,null,null,null,null,1,{"$f":"ROUND((AV176*$AW$2)+AV176,2)","v":1.05}]
["Miscellaneous Livestock_Trailer 20 FT gooseneck","Miscellaneous","Livestock_Trailer","20 FT gooseneck",null,26000,25999,null,"Extrapolation","10% increase over 20/21",null,null,null,null,null,null,null,null,null,null,null,null,null,15,100,2.1,null,null,null,null,null,18.124633772577074,5.46,3.5376950658865609,27,null,null,null,null,null,null,null,null,null,null,null,null,2,2.1]
["Miscellaneous Livestock_Trailer 24 FT gooseneck","Miscellaneous","Livestock_Trailer","24 FT gooseneck",null,38000,37900,null,"Extrapolation","10% increase over 20/21",null,null,null,null,null,null,null,null,null,null,null,null,null,15,100,2.1,null,null,null,null,null,26.489849359920335,7.98,5.1704774039880492,40,null,null,null,null,null,null,null,null,null,null,null,null,2,2.1]
["Miscellaneous Vertical_Feed_Mixer 280-360 cubic FT (requires 110 hp)","Miscellaneous","Vertical_Feed_Mixer","280-360 cubic FT (requires 110 hp)","280-360 cubic FT",43000,{"$f":"37527.5*1.15","v":43156.625},null,"Lucknow",1380,null,null,null,"Kuhn","VT 132",null,null,null,null,null,null,null,null,15,200,2.63,null,null,null,null,null,14.987677927323348,{"$f":"Z179/100*F179/Y179","v":5.6545000000000005},3.0963266890985022,24,null,null,null,{"$f":"AN8","v":135},{"$f":"IF(AI179+AJ179+AK179+AL179+AM179<10,ROUND((AI179+AJ179+AK179+AL179+AM179)/0.25,0)*0.25,ROUND(AI179+AJ179+AK179+AL179+AM179,0))","v":159},null,null,null,null,null,null,null,2.5,2.63]
["Miscellaneous Vertical_Feed_Mixer 500-750 cubic FT (requires 160 hp)","Miscellaneous","Vertical_Feed_Mixer","500-750 cubic FT (requires 160 hp)","500-750 cubic FT",{"$f":"ROUND(G180/5000,0)*5000","v":70000},{"$f":"62262.5*1.15","v":71601.875},null,"Lucknow",1615,null,null,null,"Kuhn","VT 168",null,null,null,null,null,null,null,null,15,200,2.63,null,null,null,null,null,24.398545463084513,{"$f":"Z180/100*F180/Y180","v":9.2050000000000001},5.0405318194626769,39,null,null,null,{"$f":"AN9","v":176},215,null,null,null,null,null,null,null,2.5,2.63]
["Miscellaneous Vertical_Feed_Mixer 830-1,150 cubic FT (requires 225+ hp)","Miscellaneous","Vertical_Feed_Mixer","830-1,150 cubic FT (requires 225+ hp)","830-1,150 cubic FT",100000,{"$f":"87408.3333333333*1.15","v":100519.58333333328},null,"Lucknow",2820,null,null,null,"Lucknow",2950,null,null,null,"Schuler",1060,null,null,null,15,200,2.63,null,null,null,null,null,34.8550649472636,13.15,7.2007597420895397,55,null,null,null,{"$f":"AN10","v":213},268,null,null,null,null,null,null,null,2.5,2.63]
["Miscellaneous Feed_Mixer Two 6 FT bale, 40 bu grain (requires 100 hp)","Miscellaneous","Feed_Mixer","Two 6 FT bale, 40 bu grain (requires 100 hp)","Two 6 FT bale, \n40 bu grain",{"$f":"ROUND(G182,-3)","v":65000},65000,null,"BaleKing","5300 w 40 bu tank as option",null,null,null,null,null,null,null,null,null,null,null,null,null,15,200,3.15,null,null,null,null,null,22.655792215721334,{"$f":"Z182/100*F182/Y182","v":10.237500000000001},4.9339938323581993,{"$f":"IF(AF182+AG182+AH182<10,ROUND((AF182+AG182+AH182)/0.25,0)*0.25,ROUND(AF182+AG182+AH182,0))","v":38},null,null,null,{"$f":"AN8","v":135},173,null,null,null,null,null,null,null,3,3.15]
["Miscellaneous Grinder_Mixer 360-440 cubic FT (requires 120 hp)","Miscellaneous","Grinder_Mixer","360-440 cubic FT (requires 120 hp)","360-440 cubic FT",70000,70000,null,"Artsway ","6140 (Hammer)",null,null,null,"Cattlemax","6140 (rollermill)",null,null,null,null,null,null,null,null,15,200,3.15,null,null,null,null,null,24.398545463084513,{"$f":"Z183/100*F183/Y183","v":11.025},5.3135318194626775,41,null,null,null,{"$f":"AN8","v":135},176,null,null,null,null,null,null,null,3,3.15]
["Miscellaneous Grinder_Mixer 550-750 cubic FT (requires 200 hp)","Miscellaneous","Grinder_Mixer","550-750 cubic FT (requires 200 hp)","500-750 cubic FT",90000,90000,"","Extrapolation ","10% increase 20/21 Price",null,null,null,null,null,null,null,null,null,null,null,null,null,15,200,3.15,null,null,null,null,null,31.369558452537234,14.175000000000001,6.8316837678805848,52,null,null,null,{"$f":"AN9","v":176},228,null,null,null,null,null,null,null,3,3.15]
["Miscellaneous Bale_Processor Two 6 FT round bale (requires 155 hp)","Miscellaneous","Bale_Processor","Two 6 FT round bale (requires 155 hp)","Two 6 FT round bale",{"$f":"ROUND(G185,-3)","v":40000},40000,null,"Vermeer","BPX 9010",null,null,null,"Highline","CFR 965",null,null,null,null,null,null,null,null,15,200,3.15,null,null,null,null,null,13.942025978905436,{"$f":"Z185/100*F185/Y185","v":6.3},3.0363038968358151,23,null,null,null,{"$f":"AN8","v":135},158,null,null,null,null,null,null,null,3,3.15]
["Miscellaneous Bale_Processor Six  6 FT round bale (requires 175 hp)","Miscellaneous","Bale_Processor","Six  6 FT round bale (requires 175 hp)","Six 6 FT round bale",70000,70000,null,"Bale King","6200 (no grain tank)",null,null,53000,null,null,null,null,null,null,null,null,null,null,15,200,3.15,null,null,null,null,null,24.398545463084513,11.025,5.3135318194626775,41,null,null,null,{"$f":"AN9","v":176},217,null,null,null,null,null,null,null,3,3.15]
[{"$f":"B187&\" \"&C187&\" \"&D187","v":"Miscellaneous Grain_Truck Tandem"},"Miscellaneous","Grain_Truck","Tandem",null,{"$f":"ROUND(G187/5000,0)*5000","v":200000},200000,null,null,null,null,null,null,null,null,null,null,null,null,null,null,null,null,15,150,2.63,27,null,null,null,null,{"$f":"(F187*Fraction_dep_over_optimal_life/X187/Y187)+IF(Machinery_Financed_percentage=0,0,(-CUMIPMT(Interest_Rate/2,Payback_loan_period_years*2,F187*Machinery_Financed_percentage,1,Payback_loan_period_years*2,0)/X187/Y187))+((F187*(1-Machinery_Financed_percentage)*(1+Opportunity_Rate/12)^(Opp_inv_period_years*12)-(F187*(1-Machinery_Financed_percentage)))/X187/Y187)+(Insurance_and_Housing*F187/Y187)","v":92.946839859369589},{"$f":"Z187/100*F187/Y187","v":35.06666666666667},{"$f":"Margin_percentage*(AF187+AG187)","v":19.202025978905436},147,{"$f":"AA187*Fuel_Price","v":37.799999999999997},{"$f":"Labour","v":27},{"$f":"Margin_percentage*(AJ187+AK187)","v":9.7199999999999989},null,222,null,"/acre",null,null,null,null,null,2.5,{"$f":"ROUND((AV187*$AW$2)+AV187,2)","v":2.63}]
[{"$f":"B188&\" \"&C188&\" \"&D188","v":"Miscellaneous Grain_Truck Truck and 40FT Straight Trailer"},"Miscellaneous","Grain_Truck","Truck and 40FT Straight Trailer",null,{"$f":"ROUND(G188/5000,0)*5000","v":275000},{"$f":"SUM(G197:G198)","v":275000},null,null,null,null,null,null,null,null,null,null,null,null,null,null,null,null,15,150,2.63,32,null,null,null,null,{"$f":"(F188*Fraction_dep_over_optimal_life/X188/Y188)+IF(Machinery_Financed_percentage=0,0,(-CUMIPMT(Interest_Rate/2,Payback_loan_period_years*2,F188*Machinery_Financed_percentage,1,Payback_loan_period_years*2,0)/X188/Y188))+((F188*(1-Machinery_Financed_percentage)*(1+Opportunity_Rate/12)^(Opp_inv_period_years*12)-(F188*(1-Machinery_Financed_percentage)))/X188/Y188)+(Insurance_and_Housing*F188/Y188)","v":127.80190480663317},{"$f":"Z188/100*F188/Y188","v":48.216666666666669},{"$f":"Margin_percentage*(AF188+AG188)","v":26.402785720994977},202,{"$f":"AA188*Fuel_Price","v":44.8},27,{"$f":"Margin_percentage*(AJ188+AK188)","v":10.77},null,285,null,"/acre",null,null,null,null,null,2.5,{"$f":"ROUND((AV188*$AW$2)+AV188,2)","v":2.63}]
[{"$f":"B189&\" \"&C189&\" \"&D189","v":"Miscellaneous Manure_Spreader_solid 250-299 cubic FT level, chain unload (requires 120 hp)"},"Miscellaneous","Manure_Spreader_solid","250-299 cubic FT level, chain unload (requires 120 hp)","250-299 cubic FT",35000,35000,"","New Holland","155 MBS",null,null,null,"JD/Frontier","MS1223",null,null,null,null,null,null,null,null,10,100,4.62,null,null,null,null,null,34.847818194626775,{"$f":"Z189/100*F189/Y189","v":16.170000000000002},7.6526727291940162,59,null,null,null,{"$f":"AN8","v":135},194,null,null,null,null,null,null,null,4.4000000000000004,4.62]
["Miscellaneous Manure_Spreader_solid 300-399 cubic FT level, chain unload (requires 125 hp)","Miscellaneous","Manure_Spreader_solid","300-399 cubic FT level, chain unload (requires 125 hp)","300-399 cubic FT",38000,38000,"","New Holland","185 MBS",null,null,null,"JD/Frontier","MS1231",null,null,null,null,null,null,null,null,10,100,4.62,null,null,null,null,null,37.8347740398805,17.555999999999997,8.3086161059820736,64,null,null,null,{"$f":"AN8","v":135},199,null,null,null,null,null,null,null,4.4000000000000004,4.62]
["Miscellaneous Manure_Spreader_solid 400-500 cubic FT level, chain unload (requires 150 hp)","Miscellaneous","Manure_Spreader_solid","400-500 cubic FT level, chain unload (requires 150 hp)","400-500 cubic FT",56000,56000,"","New Holland","195 MBS",null,null,null,"JD/Frontier","MS1237",null,null,null,null,null,null,null,null,10,100,4.62,null,null,null,null,null,55.756509111402856,25.872,12.244276366710427,94,null,null,null,{"$f":"AN8","v":135},229,null,null,null,null,null,null,null,4.4000000000000004,4.62]
["Miscellaneous Manure_Spreader_solid 300-399 cubic FT level, side discharge (requires 150 hp)","Miscellaneous","Manure_Spreader_solid","300-399 cubic FT level, side discharge (requires 150 hp)","300-399 cubic FT",{"$f":"ROUND(G192/5000,0)*5000","v":65000},65000,"","Kuhn","SLC 126",null,null,null,null,null,null,null,null,null,null,null,null,null,10,100,4.62,null,null,null,null,null,64.717376647164002,30.03,14.2121064970746,109,null,null,null,{"$f":"AN8","v":135},244,null,null,null,null,null,null,null,4.4000000000000004,4.62]
["Miscellaneous Manure_Spreader_solid 400-500 cubic FT level, side discharge (requires 180 hp)","Miscellaneous","Manure_Spreader_solid","400-500 cubic FT level, side discharge (requires 180 hp)","400-500 cubic FT",85000,85000,"","Kuhn ","SLC 132",null,null,null,null,null,null,null,null,null,null,null,null,null,10,100,4.62,null,null,null,null,null,84.630415615522182,39.270000000000003,18.585062342328325,142,null,null,null,{"$f":"AN9","v":176},318,null,null,null,null,null,null,null,4.4000000000000004,4.62]
["Miscellaneous Manure_Spreader_solid 500+  cubic FT level, side discharge (requires 200 hp)","Miscellaneous","Manure_Spreader_solid","500+  cubic FT level, side discharge (requires 200 hp)","500+ cubic FT",95000,95000,"","Kuhn","SLC 141",null,null,null,null,null,null,null,null,null,null,null,null,null,10,100,4.62,null,null,null,null,null,94.586935099701265,43.89,20.771540264955192,159,null,null,null,{"$f":"AN9","v":176},335,null,null,null,null,null,null,null,4.4000000000000004,4.62]
["Miscellaneous Manure_Spreader_solid 250-300 cubic FT, hyd. push, vert. beaters (requires 150 hp)","Miscellaneous","Manure_Spreader_solid","250-300 cubic FT, hyd. push, vert. beaters (requires 150 hp)","250-300 cubic FT",75000,76000,"","Kuhn","ProPush",null,null,null,"JD/Frontier","MS1442",null,null,null,null,null,null,null,null,10,100,4.62,null,null,null,null,null,74.673896131343099,34.65,16.398584419701464,126,null,null,null,{"$f":"AN8","v":135},261,null,null,null,null,null,null,null,4.4000000000000004,4.62]
["Miscellaneous Manure_Spreader_solid 400-500 cubic FT, hyd. push, vert. beaters (requires 200 hp)","Miscellaneous","Manure_Spreader_solid","400-500 cubic FT, hyd. push, vert. beaters (requires 200 hp)","400-500 cubic FT",95000,95000,"","Kuhn ","ProPush",null,null,null,"JD/Frontier","MS1455",null,null,null,null,null,null,null,null,10,100,4.62,null,null,null,null,null,94.586935099701265,43.89,20.771540264955192,159,null,null,null,{"$f":"AN9","v":176},335,null,null,null,null,null,null,null,4.4000000000000004,4.62]
["Highway Tractor",null,null,null,null,190000,190000]
["40 foot straight trailer",null,null,null,null,85000,85000]
["Water Truck ","(Select Category)",null,null,null,145000,145000,{"$f":"IFERROR(AVERAGE(M199,R199,W199),\"\")","v":""},null,null,null,null,null,null,null,null,null,null,null,null,null,null,null,10,{"$f":"Y168","v":175},3.15,27,null,null,null,null,{"$f":"(F199*Fraction_dep_over_optimal_life/X199/Y199)+IF(Machinery_Financed_percentage=0,0,(-CUMIPMT(Interest_Rate/2,Payback_loan_period_years*2,F199*Machinery_Financed_percentage,1,Payback_loan_period_years*2,0)/X199/Y199))+((F199*(1-Machinery_Financed_percentage)*(1+Opportunity_Rate/12)^(Opp_inv_period_years*12)-(F199*(1-Machinery_Financed_percentage)))/X199/Y199)+(Insurance_and_Housing*F199/Y199)","v":82.496875726055251},{"$f":"Z199/100*F199/Y199","v":26.1},{"$f":"Margin_percentage*(AF199+AG199)","v":16.289531358908288},{"$f":"IF(AF199+AG199+AH199<10,ROUND((AF199+AG199+AH199)/0.25,0)*0.25,ROUND(AF199+AG199+AH199,0))","v":125},{"$f":"AA199*Fuel_Price","v":37.799999999999997},27,{"$f":"Margin_percentage*(AJ199+AK199)","v":9.7199999999999989},null,{"$f":"IF(AI199+AJ199+AK199+AL199+AM199<10,ROUND((AI199+AJ199+AK199+AL199+AM199)/0.25,0)*0.25,ROUND(AI199+AJ199+AK199+AL199+AM199,0))","v":200},null,"/acre",null,null,null,null,null,3,3.15]

{"sheet":"Instructions","index":3,"n_rows":64,"n_cols":2,"rows_kept":64,"cut":false,"hidden":false,"merged":[[0,1,0,22]]}
[null,"Important Instructions and Notes"]
[null,"Calculator Intended Use"]
[null,"This calculator has been established to provide approximate costs for renting equipment or obtaining custom-farming operations from another farmer. "]
[null,"This calculator is not intended for establishing rates for individuals or companies that rent equipment or contract custom-farming operations as a business."]
[]
[null,"This calculator is applicable for two different situations. One is to suggest an equitable price for both parties when one farmer either rents a piece of equipment from another farmer or hires the other to do  "]
[null,"a farming operation (seeding, spraying, harvesting, etc.).  In this situation, the time of rented operation is usually relatively small in proportion to the use by the owner. "]
[null,"The other use is when farmers share equipment and need to establish the value of the machinery and/or farming operation that is being contributed to each farm."]
[]
[null,"Steps for Calculator Use"]
[null,"This calculator allows users to calculate the costs associated with the combination of up to three pieces of farm equipment."]
[null,"If the piece of equipment in question is not listed, the user can still determine costs associated with that piece of equipment. "]
[null,"To obtain information for any unlisted equipment, the user would follow the outlined procedure below for selecting any unrelated equipment, and then just change the values in BLUE to match their equipment."]
[null,"Users should review the input values at the top of the page before proceeding to steps #1 to #6."]
[null,"Users should press the Reset button if any changes have been made to the BLUE input values in Steps #4 to #6 as important formulas may be lost and need to be reset before selecting different equipment."]
[]
[null,"Procedure"]
[null,"1.     Prior to calculator use, ensure that macros have been enabled. Similarly, when saving this workbook save it as a macro-enabled file."]
[null,"2.     Select the equipment category  (#1) from the drop-down list(s) provided. "]
[null,"3.     Select the type of farm equipment (#2) from the drop-down list(s) provided."]
[null,"4.     Select the appropriate size of the farm equipment (#3) from the drop-down list(s) provided. After this selection is made, the spreadsheet will populate itself with default values."]
[null,"5.     If the default equipment cost values do not agree with your known values for the farm equipment (#4), enter in the known BLUE input values."]
[null,"6.     If the default equipment fuel useage litres per hour or Repair and Maintenance rate % do not agree with your known values for the farm equipment (#5), enter the known BLUE input values."]
[null,"7.     If the speed, width, or field efficiency of the implement is different from the default values, enter the known BLUE input values to calculate a new work rate. "]
[null,"         If the calculated work rate from the default or known input values is not accurate, enter a known work rate."]
[null,"8.     Scroll down the page to see the total costs of each implement as well as the combined costs of implements 1, 2, and 3. "]
[]
[null,"Notes on calculation procedure"]
[null,"If the user is uncertain of a tractor horsepower requirement for drawn or PTO equipment, if applicable, it will be shown in the \"Select equipment size\" drop down list."]
[null,"If there are two or more different work rates, the calculator will calculate the largest work rate for implements 1, 2, and 3. "]
[]
[null,"Caution"]
[null,"Nearly every situation has particular circumstances and conditions that are unique. Individuals should recognize these circumstances and make appropriate adjustments in the \"User-Defined\" BLUE input values"]
[null,"of this spreadsheet to obtain better cost estimates for their particular situation. "]
[]
[null,"Tractor Category Footnotes"]
[null,"Two-wheel drive tractors - based on PTO power rating"]
[null,"Front wheel assist tractors - based on PTO power rating"]
[null,"Four-wheel drive tractors - based on engine power rating"]
[null,"Tracked tractors - based on engine power rating"]
[null,"To convert net engine power to PTO, multiply by 0.88"]
[]
[null,"Harvesting Grain Category Footnotes"]
[null,"Rotary combines - annual hours of usage is based on separator usage"]
[null,"Self-propelled swathers - fuel efficiency based on 126 hp (18-22' swather), 126 hp (25' swather), 190 hp (30' swather), and 226 hp (35'+ swather)"]
[]
[null,"Harvesting Hay Category Footnotes"]
[null,"Self-propelled mower/conditioners - fuel efficiency is based on 226 hp (16-19' disc), 400 hp (30' disc), and 190 hp (14-16' sickle)"]
[null,"Balers - for the cost of twine add $0.27/bale for 4' diameter, $0.40/bale for 5' diameter and $0.76/bale for 6' diameter. Add $0.78/bale for large square and $0.05/bale for small square. For the cost of mesh add $1.25/bale. "]
[null,"Bale mover - fuel efficiency based on 173 hp"]
[]
[null,"Seeding Category Footnotes"]
[null,"Work rates may require adjustment for heavy straw conditions or high fertilizer rates"]
[null,"All air drills have been priced with an appropriately sized air tank."]
[]
[null,"Soil Preparation Category Footnotes"]
[null,"No additional notes"]
[]
[null,"Sprayers Category Footnotes"]
[null,"Cost of hauling water to the field is not included. The cost of hauling water can range from $0.26/acre to $1.74/acre depending on the rate of water application."]
[null,"These rates are not intended to be compared to commercial custom spraying rates. "]
[]
[null,"Fuel Efficiency Estimate"]
[null,"In order to obtain an estimate for fuel consumption based on engine power, the following chart can be used:"]

{"sheet":"Sprayer Water Calc","index":4,"n_rows":38,"n_cols":12,"rows_kept":38,"cut":false,"hidden":true,"merged":[[3,6,3,9]]}
["Appendix A"]
[]
["C. Hauling Water for Field Spraying - SP Sprayer"]
[null,null,null,null,null,null,"Gallons Per Acre"]
[null,null,null,null,null,null,2.5,5,10,20]
["(A)","Acres sprayed per hr is avg. of 80' and 100' booms",null,null,null,null,{"$f":"ROUND((DATA!AB166*5280*DATA!AC166*Field_efficiency*1)/43560,0)","v":97},{"$f":"ROUND((DATA!AB166*5280*DATA!AC166*Field_efficiency*0.9)/43560,0)","v":87},{"$f":"ROUND((DATA!AB166*5280*DATA!AC166*Field_efficiency*0.8)/43560,0)","v":78},{"$f":"ROUND((DATA!AB166*5280*DATA!AC166*Field_efficiency*0.7)/43560,0)","v":68},null,"*work rate*"]
["(B)","Labour cost/hr",null,null,null,null,{"$f":"Labour","v":27},{"$f":"Labour","v":27},{"$f":"Labour","v":27},{"$f":"Labour","v":27}]
["(C)","Truck cost per hour*",null,null,null,null,{"$f":"DATA!AN199-DATA!AK199","v":173},{"$f":"G8","v":173},{"$f":"G8","v":173},{"$f":"G8","v":173}]
["(D)","Truck hauls 1200 gal/load",null,null,null,null,2400,{"$f":"G9","v":2400},{"$f":"G9","v":2400},{"$f":"G9","v":2400}]
["(E)","Acres per load = 1200 gal/(gal/ac)",null,null,null,null,{"$f":"SUM(G9/G5)","v":960},{"$f":"SUM(H9/H5)","v":480},240,120]
["(F)","Hours per load = 1200 gal/(gal/ac)/(ac/hr)",null,null,null,null,{"$f":"G10/G6","v":9.8969072164948457},{"$f":"H10/H6","v":5.5172413793103452},3.0769230769230771,1.7647058823529411]
[]
[null,"Time to haul one load of water",null,null,null,null,75,{"$f":"G13","v":75},{"$f":"G13","v":75},{"$f":"G13","v":75}]
[null,"Cost of one load of water",null,null,null,null,20,{"$f":"G14","v":20},{"$f":"G14","v":20},{"$f":"G14","v":20}]
["(G)","Truck driving time going for water (min)"]
["(H)","Driving time in the field (min)"]
["(I)","Total time minutes per 160 acres (min)*",null,null,null,null,{"$f":"(160/G10)*G13","v":12.5},{"$f":"(160/H10)*H13","v":25},50,100]
[]
["(J)","Truck cost for 160 acres",null,null,null,null,{"$f":"G8*G17/60","v":36.041666666666664},{"$f":"H8*H17/60","v":72.083333333333329},{"$f":"I8*I17/60","v":144.16666666666666},{"$f":"J8*J17/60","v":288.33333333333331}]
["(K)","Labour cost for 160 acres",null,null,null,null,{"$f":"G7*G17/60","v":5.625},{"$f":"H7*H17/60","v":11.25},{"$f":"I7*I17/60","v":22.5},{"$f":"J7*J17/60","v":45}]
["(L)","Truck and labour cost for 160 acres",null,null,null,null,{"$f":"G19+G20","v":41.666666666666664},{"$f":"H19+H20","v":83.333333333333329},166.66666666666666,333.33333333333331]
["(M)",{"$f":"\"Add \"&Margin_percentage*100&\"% margin\"","v":"Add 15% margin"},null,null,null,null,{"$f":"G21*Margin_percentage","v":6.2499999999999991},{"$f":"H21*Margin_percentage","v":12.499999999999998},{"$f":"I21*Margin_percentage","v":24.999999999999996},{"$f":"J21*Margin_percentage","v":49.999999999999993}]
["(N)","Total cost of hauling for 160 acres",null,null,null,null,{"$f":"G21+G22","v":47.916666666666664},{"$f":"H21+H22","v":95.833333333333329},191.66666666666666,383.33333333333331]
["(O)","Cost of purchase or pumping water for 160 ac**",null,null,null,null,{"$f":"G5*160/1200*G14","v":6.6666666666666661},{"$f":"H5*160/1200*H14","v":13.333333333333332},26.666666666666664,53.333333333333329]
["(P)","Cost per 160 acres for hauling and water",null,null,null,null,{"$f":"G24+G23","v":54.583333333333329},{"$f":"H24+H23","v":109.16666666666666},218.33333333333331,436.66666666666663]
["(Q)","Cost per acre of hauling water",null,null,null,null,{"$f":"ROUNDUP((G25/160/0.25),0)*0.25","v":0.5},{"$f":"ROUNDUP((H25/160/0.25),0)*0.25","v":0.75},{"$f":"ROUNDUP((I25/160/0.25),0)*0.25","v":1.5},{"$f":"ROUNDUP((J25/160/0.25),0)*0.25","v":2.75}]
[null,null,null,null,null,null,null,"****round to quarter***"]
[]
["Calculations used to determine values:"]
["J = C*I/(60 min/hr)"]
["K = B*I/(60 min/hr)"]
["l = J + K"]
["M = L*15%"]
["N = L + M"]
["O = gal/acre*acres/gal*cost/load"]
["   = 2.5*160/1200*10.00"]
["P = N + O"]
["Q = P/160"]

{"sheet":"Editing notes","index":5,"n_rows":33,"n_cols":6,"rows_kept":33,"cut":false,"hidden":true,"merged":[]}
["Date","Changes made/notes","Person involved in modification(s)",null,null,"New way to calculate interest:"]
["2023-07-19","moved MB-SK price list to working folder","Sharon"]
["2023-07-19","final look over of price calculator","Sharon",null,null,"\"=-CUMIPMT(a,b,c,1,b,0)\""]
["2023-07-19","highlighted assumptions in Introduction word document","Sharon"]
["2023-07-19","highlighted calculations in appendices for G-H-I that need to be updated once assumptions are sett","Sharon",null,null,"need the negative in front of the function because it returns a negative value on its own"]
["2023-07-25","interest rate discussion: term 7.75% & Operating 8.50% to match spring resource update","Sharon",null,null,"a = interest rate (%)"]
["2023-07-26","start updating prices of misc equipment","Sharon",null,null,"b = number of periods in payback period"]
[null,null,"Sharon",null,null,"c = amount financed"]
[null,null,"Sharon"]
[null,null,"Sharon",null,null,"If biannual payments:"]
[null,null,null,null,null,"a = annual interest rate divided by 2"]
[null,null,"Sharon"]
[null,null,"Sharon",null,null,"b = number of years in payback period multiplied by 2"]
[]
[null,null,null,null,null,"If monthly payments:"]
[null,null,null,null,null,"a = annual interest rate divided by 12"]
[null,null,"Sharon",null,null,"b = number of years in payback period multiplied by 12"]
[null,null,"Sharon"]
[null,null,"Sharon"]
[null,null,"Sharon",null,null,"New way to calculate opportunity cost:"]
[null,null,"Sharon"]
[null,null,"Sharon",null,null,"\"=A*(1+B)^C-A\""]
[null,null,"Sharon"]
[null,null,"Sharon",null,null,"A = amount in down payment (that would otherwise be invested)"]
[null,null,"Sharon",null,null,"B = interest rate (%)"]
[null,null,"Sharon",null,null,"C = number of periods in payback period"]
[]
[null,null,null,null,null,"If monthly compounding"]
[null,null,null,null,null,"B = annual interest rate divided by 12"]
[null,null,null,null,null,"C = number of years mulitplied by 12"]
[]
[]
[null,null,null,null,null,"Note: number of years for opportunity cost equal to 7 since most equipment is owned for this length of time"]

{"sheet":"Summary","index":6,"n_rows":50,"n_cols":15,"rows_kept":50,"cut":false,"hidden":true,"merged":[[39,11,39,13],[2,11,2,14],[2,3,2,5],[2,7,2,9],[51,1,51,14],[24,3,24,5],[24,7,24,9],[32,3,32,5],[32,7,32,9],[32,11,32,13],[43,3,43,5],[43,7,43,9],[38,3,38,5],[39,3,39,5],[38,7,38,9],[39,7,39,9],[38,11,38,13]]}
[null,null,null,null,null,null,null,null,null,null,null,null,null,null,"Equipment Summary"]
[]
[null,"Equipment","Description","Rental Rate\n(per hour)",null,null,null,"Custom Rate\n(per hour)",null,null,null,"Average\nCustom Rate*"]
[null,"Tractors","Two-Wheel Drive",{"$f":"MIN(DATA!AI6,DATA!AI7)","v":46},"to",{"$f":"MAX(DATA!AI6,DATA!AI7)","v":51},null,{"$f":"MIN(DATA!AN6,DATA!AN7)","v":116},"to",{"$f":"MAX(DATA!AN6,DATA!AN7)","v":127}]
[null,null,"Front Wheel Assist",{"$f":"MIN(DATA!AI8,DATA!AI9,DATA!AI10)","v":62},"to",{"$f":"MAX(DATA!AI8,DATA!AI9,DATA!AI10)","v":105},null,{"$f":"MIN(DATA!AN8,DATA!AN9,DATA!AN10)","v":135},"to",{"$f":"MAX(DATA!AN8,DATA!AN9,DATA!AN10)","v":213}]
[null,null,"Four-Wheel Drive",{"$f":"MIN(DATA!AI11,DATA!AI12,DATA!AI13)","v":147},"to",{"$f":"MAX(DATA!AI11,DATA!AI12,DATA!AI13)","v":178},null,{"$f":"MIN(DATA!AN11,DATA!AN12,DATA!AN13)","v":279},"to",{"$f":"MAX(DATA!AN11,DATA!AN12,DATA!AN13)","v":351}]
[null,null,"Tracked",{"$f":"MIN(DATA!AI14,DATA!AI15,DATA!AI16,DATA!AI17,DATA!AI18)","v":152},"to",{"$f":"MAX(DATA!AI14,DATA!AI15,DATA!AI16,DATA!AI17,DATA!AI18)","v":224},null,{"$f":"MIN(DATA!AN14,DATA!AN15,DATA!AN16,DATA!AN17,DATA!AN18)","v":284},"to",{"$f":"MAX(DATA!AN14,DATA!AN15,DATA!AN16,DATA!AN17,DATA!AN18)","v":440}]
[null,"Combine","Rotary",{"$f":"MIN(DATA!AI19,DATA!AI20,DATA!AI21,DATA!AI22,DATA!AI23,DATA!AI24)","v":255},"to",{"$f":"MAX(DATA!AI19,DATA!AI20,DATA!AI21,DATA!AI22,DATA!AI23,DATA!AI24)","v":485},null,{"$f":"MIN(DATA!AN19,DATA!AN20,DATA!AN21,DATA!AN22,DATA!AN23,DATA!AN24)","v":355},"to",{"$f":"MAX(DATA!AN19,DATA!AN20,DATA!AN21,DATA!AN22,DATA!AN23,DATA!AN24)","v":661},null,{"$f":"MIN(DATA!AO19,DATA!AO20,DATA!AO21,DATA!AO22,DATA!AO23,DATA!AO24)","v":31},"to",{"$f":"MAX(DATA!AO19,DATA!AO20,DATA!AO21,DATA!AO22,DATA!AO23,DATA!AO24)","v":44},"per acre"]
[null,"Combine Header",null,{"$f":"MIN(DATA!AI25,DATA!AI26,DATA!AI27,DATA!AI28,DATA!AI29,DATA!AI30,DATA!AI31,DATA!AI32,DATA!AI33,DATA!AI34,DATA!AI35,DATA!AI36,DATA!AI37,DATA!AI38,DATA!AI39,DATA!AI40)","v":13},"to",{"$f":"MAX(DATA!AI25,DATA!AI26,DATA!AI27,DATA!AI28,DATA!AI29,DATA!AI30,DATA!AI31,DATA!AI32,DATA!AI33,DATA!AI34,DATA!AI35,DATA!AI36,DATA!AI37,DATA!AI38,DATA!AI39,DATA!AI40)","v":279}]
[null,"Swather",null,{"$f":"MIN(DATA!AI41,DATA!AI42,DATA!AI43,DATA!AI44)","v":117},"to",{"$f":"MAX(DATA!AI41,DATA!AI42,DATA!AI43,DATA!AI44)","v":156},null,{"$f":"MIN(DATA!AN41,DATA!AN42,DATA!AN43,DATA!AN44)","v":183},"to",{"$f":"MAX(DATA!AN41,DATA!AN42,DATA!AN43,DATA!AN44)","v":245},null,{"$f":"MIN(DATA!AO41,DATA!AO42,DATA!AO43,DATA!AO44)","v":12},"to",{"$f":"MAX(DATA!AO41,DATA!AO42,DATA!AO43,DATA!AO44)","v":14},"per acre"]
[null,"Grain Cart",null,{"$f":"MIN(DATA!AI45,DATA!AI46,DATA!AI47)","v":35},"to",{"$f":"MAX(DATA!AI45,DATA!AI46,DATA!AI47)","v":108},null,{"$f":"MIN(DATA!AN45,DATA!AN46,DATA!AN47)","v":314},"to",{"$f":"MAX(DATA!AN45,DATA!AN46,DATA!AN47)","v":459}]
[null,"Grain Auger","Powered",{"$f":"MIN(DATA!AI48,DATA!AI49,DATA!AI50,DATA!AI51,DATA!AI52,DATA!AI53)","v":19},"to",{"$f":"MAX(DATA!AI48,DATA!AI49,DATA!AI50,DATA!AI51,DATA!AI52,DATA!AI53)","v":31}]
[null,"Grain Auger","PTO",{"$f":"MIN(DATA!AI54,DATA!AI55,DATA!AI56,DATA!AI57,DATA!AI58)","v":9},"to",{"$f":"MAX(DATA!AI54,DATA!AI55,DATA!AI56,DATA!AI57,DATA!AI58)","v":94},null,{"$f":"MIN(DATA!AN54,DATA!AN55,DATA!AN56,DATA!AN57,DATA!AN58)","v":144},"to",{"$f":"MAX(DATA!AN54,DATA!AN55,DATA!AN56,DATA!AN57,DATA!AN58)","v":270}]
[null,"Grain Conveyor","PTO",{"$f":"MIN(DATA!AI61,DATA!AI62)","v":63},"to",{"$f":"MAX(DATA!AI61,DATA!AI62)","v":140},null,{"$f":"MIN(DATA!AN61,DATA!AN62)","v":179},"to",{"$f":"MAX(DATA!AN61,DATA!AN62)","v":275}]
[null,"Grain Vac",null,{"$f":"MIN(DATA!AI72,DATA!AI73)","v":94},"to",{"$f":"MAX(DATA!AI72,DATA!AI73)","v":136},null,{"$f":"MIN(DATA!AN72,DATA!AN73)","v":210},"to ",{"$f":"MAX(DATA!AN72,DATA!AN73)","v":263}]
[null,"SP Forage Harvester",null,{"$f":"MIN(DATA!AI74,DATA!AI75,DATA!AI76)","v":277},"to",{"$f":"MAX(DATA!AI74,DATA!AI75,DATA!AI76)","v":396},null,{"$f":"MIN(DATA!AN74,DATA!AN75,DATA!AN76)","v":435},"to",{"$f":"MAX(DATA!AN74,DATA!AN75,DATA!AN76)","v":622},null,{"$f":"MIN(DATA!AN74,DATA!AN75,DATA!AN76)/MAX(DATA!AD77,DATA!AD78,DATA!AD79)","v":25.588235294117649},"to",{"$f":"MAX(DATA!AN74,DATA!AN75,DATA!AN76)/MIN(DATA!AD77,DATA!AD78,DATA!AD79)","v":69.111111111111114},"per acre"]
[null,"SP Forage Header",null,{"$f":"MIN(DATA!AI77,DATA!AI78,DATA!AI79)","v":32},"to",{"$f":"MAX(DATA!AI77,DATA!AI78,DATA!AI79)","v":119}]
[null,"Mower Conditioner","Self Propelled",{"$f":"MIN(DATA!AI87,DATA!AI88,DATA!AI89)","v":178},"to",{"$f":"MAX(DATA!AI87,DATA!AI88,DATA!AI89)","v":356},null,{"$f":"MIN(DATA!AN87,DATA!AN88,DATA!AN89)","v":261},"to",{"$f":"MAX(DATA!AN87,DATA!AN88,DATA!AN89)","v":490},null,{"$f":"MIN(DATA!AO87,DATA!AO88,DATA!AO89)","v":21},"to",{"$f":"MAX(DATA!AO87,DATA!AO88,DATA!AO89)","v":29},"per acre"]
[null,"Mower Conditioner","Pull Type",{"$f":"MIN(DATA!AI90,DATA!AI91,DATA!AI92,DATA!AI93,DATA!AI94)","v":21},"to",{"$f":"MAX(DATA!AI90,DATA!AI91,DATA!AI92,DATA!AI93,DATA!AI94)","v":48},null,{"$f":"MIN(DATA!AN90,DATA!AN91,DATA!AN92,DATA!AN93,DATA!AN94)","v":137},"to",{"$f":"MAX(DATA!AN90,DATA!AN91,DATA!AN92,DATA!AN93,DATA!AN94)","v":164},null,{"$f":"MIN(DATA!AO90,DATA!AO91,DATA!AO92,DATA!AO93,DATA!AO94)","v":14},"to",{"$f":"MAX(DATA!AO90,DATA!AO91,DATA!AO92,DATA!AO93,DATA!AO94)","v":34},"per acre"]
[null,"Hay Rakes",null,{"$f":"MIN(DATA!AI95,DATA!AI96,DATA!AI97)","v":26},"to",{"$f":"MAX(DATA!AI95,DATA!AI96,DATA!AI97)","v":78},null,{"$f":"MIN(DATA!AN95,DATA!AN96,DATA!AN97)","v":142},"to",{"$f":"MAX(DATA!AN95,DATA!AN96,DATA!AN97)","v":194},null,{"$f":"MIN(DATA!AO95,DATA!AO96,DATA!AO97)","v":9.75},"to",{"$f":"MAX(DATA!AO95,DATA!AO96,DATA!AO97)","v":14},"per acre"]
[null,"Baler","Small Square",{"$f":"MIN(DATA!AI103,DATA!AI104)","v":23},"to",{"$f":"MAX(DATA!AI103,DATA!AI104)","v":34},null,{"$f":"MIN(DATA!AN103,DATA!AN104)","v":139},"to",{"$f":"MAX(DATA!AN103,DATA!AN104)","v":150},null,{"$f":"MIN(DATA!AO103,DATA!AO104)","v":0.75},"to",{"$f":"MAX(DATA!AO103,DATA!AO104)","v":0.75},"per bale"]
[null,"Baler","Large Square",{"$f":"MIN(DATA!AI105,DATA!AI106,DATA!AI107)","v":107},"to",{"$f":"MAX(DATA!AI105,DATA!AI106,DATA!AI107)","v":151},null,{"$f":"MIN(DATA!AN105,DATA!AN106,DATA!AN107)","v":242},"to",{"$f":"MAX(DATA!AN105,DATA!AN106,DATA!AN107)","v":327},null,{"$f":"MIN(DATA!AO105,DATA!AO106,DATA!AO107)","v":6},"to",{"$f":"MAX(DATA!AO105,DATA!AO106,DATA!AO107)","v":8.25},"per bale"]
[null,"Baler","Round",{"$f":"MIN(DATA!AI98,DATA!AI99,DATA!AI100,DATA!AI101,DATA!AI102)","v":47},"to",{"$f":"MAX(DATA!AI98,DATA!AI99,DATA!AI100,DATA!AI101,DATA!AI102)","v":84},null,{"$f":"MIN(DATA!AN98,DATA!AN99,DATA!AN100,DATA!AN101,DATA!AN102)","v":163},"to",{"$f":"MAX(DATA!AN98,DATA!AN99,DATA!AN100,DATA!AN101,DATA!AN102)","v":219},null,{"$f":"MIN(DATA!AO98,DATA!AO99,DATA!AO100,DATA!AO101,DATA!AO102)+0.8","v":11.8},"to",{"$f":"MAX(DATA!AO98,DATA!AO99,DATA!AO100,DATA!AO101,DATA!AO102)+1","v":17},"per bale"]
[null,"Bale Mover","Pull Type - Round",{"$f":"MIN(DATA!AI108,DATA!AI109)","v":44},"to",{"$f":"MAX(DATA!AI108,DATA!AI109)","v":77},null,{"$f":"MIN(DATA!AN108,DATA!AN109)","v":179},"to",{"$f":"MAX(DATA!AN108,DATA!AN109)","v":253}]
[null,"Bale Mover","SP - Small Square",{"$f":"DATA!AI113","v":254},null,null,null,{"$f":"DATA!AN113","v":330}]
[null,"Air Drills with independent openers",null,{"$f":"MIN(DATA!AI114,DATA!AI115,DATA!AI116)","v":245},"to",{"$f":"MAX(DATA!AI114,DATA!AI115,DATA!AI116)","v":582},null,{"$f":"MIN(DATA!AN114,DATA!AN116,DATA!AN116)","v":524},"to",{"$f":"MAX(DATA!AN114,DATA!AN116,DATA!AN116)","v":933},null,{"$f":"MIN(DATA!AO114,DATA!AO115,DATA!AO116)","v":31},"to",{"$f":"MAX(DATA!AO114,DATA!AO115,DATA!AO116)","v":37},"per acre"]
[null,"Air Hoe Drills",null,{"$f":"MIN(DATA!AI117,DATA!AI118)","v":175},"to",{"$f":"MAX(DATA!AI117,DATA!AI118)","v":436},null,{"$f":"MIN(DATA!AN117,DATA!AN118)","v":454},"to",{"$f":"MAX(DATA!AN117,DATA!AN118)","v":787},null,{"$f":"MIN(DATA!AO117,DATA!AO118)","v":28},"to",{"$f":"MAX(DATA!AO117,DATA!AO118)","v":33},"per acre"]
[null,"Air Disc Drills",null,{"$f":"MIN(DATA!AI119,DATA!AI120)","v":349},"to",{"$f":"MAX(DATA!AI119,DATA!AI120)","v":553},null,{"$f":"MIN(DATA!AN119,DATA!AN120)","v":668},"to",{"$f":"MAX(DATA!AN119,DATA!AN120)","v":904},null,{"$f":"MIN(DATA!AO119,DATA!AO120)","v":32},"to",{"$f":"MAX(DATA!AO119,DATA!AO120)","v":35},"per acre"]
[null,"Air Seeders",null,{"$f":"MIN(DATA!AI121,DATA!AI122,DATA!AI122)","v":175},"to",{"$f":"MAX(DATA!AI121,DATA!AI122,DATA!AI123)","v":436},null,{"$f":"MIN(DATA!AN121,DATA!AN122,DATA!AN123)","v":454},"to",{"$f":"MAX(DATA!AN121,DATA!AN122,DATA!AN123)","v":787},null,{"$f":"MIN(DATA!AO121,DATA!AO122,DATA!AO123)","v":30},"to",{"$f":"MAX(DATA!AO121,DATA!AO122,DATA!AO123)","v":35},"per acre"]
[null,"Row Crop Planters",null,{"$f":"MIN(DATA!AI124,DATA!AI125,DATA!AI126,DATA!AI127,DATA!AI128)","v":277},"to",{"$f":"MAX(DATA!AI124,DATA!AI125,DATA!AI126,DATA!AI127,DATA!AI128)","v":684},null,{"$f":"MIN(DATA!AN124,DATA!AN125,DATA!AN126,DATA!AN127,DATA!AN128)","v":412},"to",{"$f":"MAX(DATA!AN124,DATA!AN125,DATA!AN126,DATA!AN127,DATA!AN128)","v":897},null,{"$f":"MIN(DATA!AO124,DATA!AO125,DATA!AO126,DATA!AO127,DATA!AO128)","v":32},"to",{"$f":"MAX(DATA!AO124,DATA!AO125,DATA!AO126,DATA!AO127,DATA!AO128)","v":37},"per acre"]
[null,"Cultivators","Field, heavy duty",{"$f":"MIN(DATA!AI129,DATA!AI130,DATA!AI131,DATA!AI132,DATA!AI133,DATA!AI134)","v":41},"to",{"$f":"MAX(DATA!AI129,DATA!AI130,DATA!AI131,DATA!AI132,DATA!AI133,DATA!AI134)","v":81},null,{"$f":"MIN(DATA!AN129,DATA!AN130,DATA!AN131,DATA!AN132,DATA!AN133,DATA!AN134)","v":254},"to",{"$f":"MAX(DATA!AN129,DATA!AN130,DATA!AN131,DATA!AN132,DATA!AN133,DATA!AN134)","v":432},null,{"$f":"MIN(DATA!AO129,DATA!AO131,DATA!AO131,DATA!AO132,DATA!AO133,DATA!AO134)","v":14},"to",{"$f":"MAX(DATA!AO129,DATA!AO131,DATA!AO131,DATA!AO132,DATA!AO133,DATA!AO134)","v":22},"per acre"]
[null,"Harrows","Mid, Heavy",{"$f":"MIN(DATA!AI135,DATA!AI136)","v":90},"to",{"$f":"MAX(DATA!AI135,DATA!AI136)","v":101},null,{"$f":"MIN(DATA!AN135,DATA!AN136)","v":369},"to",{"$f":"MAX(DATA!AN135,DATA!AN136)","v":452},null,{"$f":"MIN(DATA!AO135,DATA!AO136)","v":7.25},"to",{"$f":"MAX(DATA!AO135,DATA!AO136)","v":8.75},"per acre"]
[null,"Harrows","Packers",{"$f":"DATA!AI137","v":15},null,null,null,{"$f":"DATA!AN137","v":191},null,null,null,{"$f":"DATA!AO137","v":6},null,null,"per acre"]
[null,"Vertical Tillage Tools","Compact, High Speed",{"$f":"MIN(DATA!AI138,DATA!AI139)","v":105},"to",{"$f":"MAX(DATA!AI138,DATA!AI139)","v":158},null,{"$f":"MIN(DATA!AN138,DATA!AN139)","v":384},"to",{"$f":"MAX(DATA!AN138,DATA!AN139)","v":509},null,{"$f":"MIN(DATA!AO138,DATA!AO139)","v":16},"to",{"$f":"MAX(DATA!AO138,DATA!AO139)","v":24},"per acre"]
[null,"Vertical Tillage Tools","Heavy Duty",{"$f":"MIN(DATA!AI140,DATA!AI141)","v":153},"to",{"$f":"MAX(DATA!AI140,DATA!AI141)","v":263},null,{"$f":"MIN(DATA!AN140,DATA!AN141)","v":472},"to",{"$f":"MAX(DATA!AN140,DATA!AN141)","v":614},null,{"$f":"MIN(DATA!AO140,DATA!AO141)","v":24},"to",{"$f":"MAX(DATA!AO140,DATA!AO141)","v":34},"per acre"]
[null,"Land Roller","Multi Section",{"$f":"MIN(DATA!AI143,DATA!AI144)","v":75},"to ",{"$f":"MAX(DATA!AI143,DATA!AI144)","v":110},null,{"$f":"MIN(DATA!AN143,DATA!AN144)","v":288},"to",{"$f":"MAX(DATA!AN143,DATA!AN144)","v":389},null,{"$f":"MIN(DATA!AO143,DATA!AO144)","v":10},"to",{"$f":"MAX(DATA!AO143,DATA!AO144)","v":11},"per acre"]
[null,"Land Scraper",null,{"$f":"MIN(DATA!AI145,DATA!AI146,DATA!AI147,DATA!AI148,DATA!AI149)","v":136},"to",{"$f":"MAX(DATA!AI145,DATA!AI146,DATA!AI147,DATA!AI148,DATA!AI149)","v":271},null,{"$f":"MIN(DATA!AN145,DATA!AN146,DATA!AN147,DATA!AN148,DATA!AN149)","v":415},"to ",{"$f":"MAX(DATA!AN145,DATA!AN146,DATA!AN147,DATA!AN148,DATA!AN149)","v":622}]
[null,"Sprayers","High Clearance",{"$f":"MIN(DATA!AI165,DATA!AI166,DATA!AI167,DATA!AI168)","v":496},"to",{"$f":"MAX(DATA!AI165,DATA!AI166,DATA!AI167,DATA!AI168)","v":756},null,{"$f":"MIN(DATA!AN165,DATA!AN166,DATA!AN167,DATA!AN168)","v":593},"to",{"$f":"MAX(DATA!AN165,DATA!AN166,DATA!AN167,DATA!AN168)","v":900},null,{"$f":"MIN(DATA!AO165,DATA!AO166,DATA!AO167,DATA!AO168)+'Sprayer Water Calc'!I26","v":10},"to",{"$f":"MAX(DATA!AO165,DATA!AO166,DATA!AO167,DATA!AO168)+'Sprayer Water Calc'!I26","v":10.75},"per acre"]
[null,"Granular Applicator","Spin",{"$f":"DATA!AI154","v":37},null,null,null,{"$f":"DATA!AN154","v":153},null,null,null,{"$f":"DATA!AO154","v":8},null,null,"per acre"]
[null,"Granular Applicator","Boom",{"$f":"DATA!AI155","v":182},null,null,null,{"$f":"DATA!AN155","v":395},null,null,null,{"$f":"DATA!AO155","v":11},null,null,"per acre"]
[null,"Post Pounder",null,{"$f":"MIN(DATA!AI169,DATA!AI170)","v":23},"to",{"$f":"MAX(DATA!AI169,DATA!AI170)","v":54},null,{"$f":"MIN(DATA!AN169,DATA!AN170)","v":139},"to",{"$f":"MAX(DATA!AN169,DATA!AN170)","v":170}]
[null,"Vertical Feed Mixers",null,{"$f":"MIN(DATA!AI179,DATA!AI180,DATA!AI181)","v":24},"to",{"$f":"MAX(DATA!AI179,DATA!AI180,DATA!AI181)","v":55},null,{"$f":"MIN(DATA!AN179,DATA!AN180,DATA!AN181)","v":159},"to",{"$f":"MAX(DATA!AN179,DATA!AN180,DATA!AN181)","v":268}]
[null,"Grinder Mixer",null,{"$f":"MIN(DATA!AI183,DATA!AI184)","v":41},"to",{"$f":"MAX(DATA!AI183,DATA!AI184)","v":52},null,{"$f":"MIN(DATA!AN183,DATA!AN184)","v":176},"to",{"$f":"MAX(DATA!AN183,DATA!AN184)","v":228}]
[null,"Feed Mixer",null,{"$f":"DATA!AI182","v":38},null,null,null,{"$f":"DATA!AN182","v":173}]
[null,"Bale Processor",null,{"$f":"MIN(DATA!AI185,DATA!AI186)","v":23},"to",{"$f":"MAX(DATA!AI185,DATA!AI186)","v":41},null,{"$f":"MIN(DATA!AN185,DATA!AN186)","v":158},"to",{"$f":"MAX(DATA!AN185,DATA!AN186)","v":217}]
[null,"Manure Spreaders",null,{"$f":"MIN(DATA!AI189,DATA!AI190,DATA!AI1891,DATA!AI192,DATA!AI193,DATA!AI194,DATA!AI195,DATA!AI196)","v":59},"to",{"$f":"MAX(DATA!AI189,DATA!AI190,DATA!AI1891,DATA!AI192,DATA!AI193,DATA!AI194,DATA!AI195,DATA!AI196)","v":159},null,{"$f":"MIN(DATA!AN189,DATA!AN190,DATA!AN191,DATA!AN192,DATA!AN193,DATA!AN194,DATA!AN195,DATA!AN196)","v":194},"to",{"$f":"MAX(DATA!AN189,DATA!AN190,DATA!AN191,DATA!AN192,DATA!AN193,DATA!AN194,DATA!AN195,DATA!AN196)","v":335}]
[]
[null,{"$f":"\"Hauling grain from field to yard estimated at \"&TEXT('Appendix A'!G41,\"$#.##\")&\" per bushel for first 3 miles plus \"&TEXT(ROUND('Appendix A'!H41,2)-ROUND('Appendix A'!G41,2),\"$#.##\")&\" per bushel for each additional mile.\"","v":"Hauling grain from field to yard estimated at $.35 per bushel for first 3 miles plus $.03 per bushel for each additional mile."}]
[null,"Rental rates include value of equipment only. Custom rates include value of equipment, power unit (if required), fuel, and labour."]
[null,"* Exercise caution when using these average figures as they may not reflect actual situations. They should be used as a guideline only. \n"]

{"sheet":"Power Units-2Wheel Drive","index":7,"n_rows":38,"n_cols":11,"rows_kept":38,"cut":false,"hidden":true,"merged":[[22,7,24,7],[22,8,24,8],[22,9,24,9],[22,10,24,10],[21,0,21,10],[22,0,24,0],[22,1,24,1],[22,2,24,2],[22,3,24,3],[22,4,24,4],[22,5,24,5],[22,6,24,6],[2,0,2,10],[3,0,5,0],[3,1,5,1],[3,2,5,2],[3,3,5,3],[3,4,5,4],[3,5,5,5],[3,6,5,6],[3,7,5,7],[3,8,5,8],[3,9,5,9],[3,10,5,10]]}
["Power Units"]
[]
["Two Wheel Drive Tractors"]
["Machine Size","Purchase Price","Litre / Hour","Ownership Cost\n($/hr)","Repair\n& Maint.\n(R&M)\nCost\n($/hr)","Margin on Ownership and R&M\n($/hr)","Rental Rate    ($/hr)","Fuel Cost           ($/hr)","Labour Cost\n($/hr)","Margin on Labour & Fuel\n($/hr)","Custom Rate                     ($/hr)"]
[]
[]
[]
[{"$f":"DATA!D6","v":"100-119 hp"},{"$f":"DATA!F6","v":155000},{"$f":"DATA!AA6","v":24},{"$f":"DATA!AF6","v":28.304342000795952},{"$f":"DATA!AG6","v":11.935},{"$f":"DATA!AH6","v":6.0359013001193924},{"$f":"DATA!AI6","v":46},{"$f":"DATA!AJ6","v":33.599999999999994},{"$f":"DATA!AK6","v":27},{"$f":"DATA!AL6","v":9.0899999999999981},{"$f":"DATA!AN6","v":116}]
[]
[{"$f":"DATA!D7","v":"120+ hp"},{"$f":"DATA!F7","v":170000},{"$f":"DATA!AA7","v":28},{"$f":"DATA!AF7","v":31.043471871840726},{"$f":"DATA!AG7","v":13.09},{"$f":"DATA!AH7","v":6.6200207807761089},{"$f":"DATA!AI7","v":51},{"$f":"DATA!AJ7","v":39.199999999999996},{"$f":"DATA!AK7","v":27},{"$f":"DATA!AL7","v":9.9299999999999979},{"$f":"DATA!AN7","v":127}]
[]
[{"$f":"\"Annual hours of use: \"&DATA!Y6","v":"Annual hours of use: 300"}]
["Notes:  Fuel type is diesel with a 75% load assumption. To calculate fuel consumption with alternative load, refer to Appendix E."]
["            Power rating represents PTO power."]
["            If tractor rating is given in net engine power, multiply by 0.88 to get PTO power."]
[]
[]
[]
[]
[]
[]
["Front Wheel Assist Tractors"]
["Machine Size","Purchase Price","Litre / Hour","Ownership Cost\n($/hr)","Repair\n& Maint.\n(R&M)\nCost\n($/hr)","Margin on Ownership and R&M\n($/hr)","Rental Rate    ($/hr)","Fuel Cost           ($/hr)","Labour Cost\n($/hr)","Margin on Labour & Fuel\n($/hr)","Custom Rate                     ($/hr)"]
[]
[]
["Small"]
[{"$f":"DATA!E8","v":"(100-159 hp)"},{"$f":"DATA!F8","v":250000},{"$f":"DATA!AA8","v":26},{"$f":"DATA!AF8","v":38.727849941404003},{"$f":"DATA!AG8","v":15.166666666666666},{"$f":"DATA!AH8","v":8.0841774912105997},{"$f":"DATA!AI8","v":62},{"$f":"DATA!AJ8","v":36.4},{"$f":"DATA!AK8","v":27},{"$f":"DATA!AL8","v":9.51},{"$f":"DATA!AN8","v":135}]
[]
["Medium"]
[{"$f":"DATA!E9","v":"(160-224 hp)"},{"$f":"DATA!F9","v":350000},{"$f":"DATA!AA9","v":36},{"$f":"DATA!AF9","v":54.218989917965594},{"$f":"DATA!AG9","v":21.233333333333334},{"$f":"DATA!AH9","v":11.317848487694841},{"$f":"DATA!AI9","v":87},{"$f":"DATA!AJ9","v":50.4},{"$f":"DATA!AK9","v":27},{"$f":"DATA!AL9","v":11.610000000000001},{"$f":"DATA!AN9","v":176}]
[]
["Large"]
[{"$f":"DATA!E10","v":"(225+ hp)"},{"$f":"DATA!F10","v":425000},{"$f":"DATA!AA10","v":48},{"$f":"DATA!AF10","v":65.83734490038681},{"$f":"DATA!AG10","v":25.783333333333335},{"$f":"DATA!AH10","v":13.743101735058021},{"$f":"DATA!AI10","v":105},{"$f":"DATA!AJ10","v":67.199999999999989},{"$f":"DATA!AK10","v":27},{"$f":"DATA!AL10","v":14.129999999999997},{"$f":"DATA!AN10","v":213}]
[]
[{"$f":"\"Annual hours of use: \"&DATA!Y9","v":"Annual hours of use: 450"}]
["Notes:  Fuel type is diesel, with a 75% load assumption. To calculate fuel consumption with alternative load, refer to Appendix E."]
["            Power rating represents PTO power."]
["            If tractor rating is given in net engine power, multiply by 0.88 to get PTO power."]

{"sheet":"Power Units-4 Wheel Drive","index":8,"n_rows":44,"n_cols":11,"rows_kept":44,"cut":false,"hidden":true,"merged":[[26,0,27,0],[29,0,30,0],[32,0,33,0],[35,0,36,0],[38,0,39,0],[3,9,5,9],[3,10,5,10],[2,0,2,10],[3,0,5,0],[3,1,5,1],[3,2,5,2],[3,3,5,3],[3,4,5,4],[3,5,5,5],[3,6,5,6],[3,7,5,7],[3,8,5,8],[23,10,25,10],[22,0,22,10],[23,0,25,0],[23,1,25,1],[23,2,25,2],[23,3,25,3],[23,4,25,4],[23,5,25,5],[23,6,25,6],[23,7,25,7],[23,8,25,8],[23,9,25,9]]}
[null,null,null,null,null,null,null,null,null,null,"Power Units"]
[]
["Four-Wheel Drive Tractors"]
["Machine Size","Purchase Price","Litre / Hour","Ownership Cost\n($/hr)","Repair\n& Maint.\n(R&M)\nCost\n($/hr)","Margin on Ownership and R&M\n($/hr)","Rental Rate    ($/hr)","Fuel Cost           ($/hr)","Labour Cost\n($/hr)","Margin on Labour & Fuel\n($/hr)","Custom Rate                     ($/hr)"]
[]
[]
["Small"]
[{"$f":"DATA!E11","v":"(350-449 hp)"},{"$f":"DATA!F11","v":600000},{"$f":"DATA!AA11","v":63},{"$f":"DATA!AF11","v":92.946839859369589},{"$f":"DATA!AG11","v":35.06666666666667},{"$f":"DATA!AH11","v":19.202025978905436},{"$f":"DATA!AI11","v":147},{"$f":"DATA!AJ11","v":88.199999999999989},{"$f":"DATA!AK11","v":27},{"$f":"DATA!AL11","v":17.279999999999998},{"$f":"DATA!AN11","v":279}]
[]
["Medium"]
[{"$f":"DATA!E12","v":"(450-549 hp)"},{"$f":"DATA!F12","v":675000},{"$f":"DATA!AA12","v":76},{"$f":"DATA!AF12","v":104.5651948417908},{"$f":"DATA!AG12","v":39.450000000000003},{"$f":"DATA!AH12","v":21.602279226268617},{"$f":"DATA!AI12","v":166},{"$f":"DATA!AJ12","v":106.39999999999999},{"$f":"DATA!AK12","v":27},{"$f":"DATA!AL12","v":20.009999999999994},{"$f":"DATA!AN12","v":319}]
[]
["Large"]
[{"$f":"DATA!E13","v":"(550+ hp)"},{"$f":"DATA!F13","v":725000},{"$f":"DATA!AA13","v":88},{"$f":"DATA!AF13","v":112.31076483007162},{"$f":"DATA!AG13","v":42.37222222222222},{"$f":"DATA!AH13","v":23.202448057844077},{"$f":"DATA!AI13","v":178},{"$f":"DATA!AJ13","v":123.19999999999999},{"$f":"DATA!AK13","v":27},{"$f":"DATA!AL13","v":22.529999999999998},{"$f":"DATA!AN13","v":351}]
[]
[{"$f":"\"Annual hours of use: \"&DATA!Y11","v":"Annual hours of use: 450"}]
["Notes:  Fuel type is diesel, with a 75% load assumption. To calculate fuel consumption with alternative load, refer to Appendix E."]
["            Power rating represents engine power."]
[]
[]
[]
[]
["Tracked Tractors"]
["Machine Size","Purchase Price","Litre / Hour","Ownership Cost\n($/hr)","Repair\n& Maint.\n(R&M)\nCost\n($/hr)","Margin on Ownership and R&M\n($/hr)","Rental Rate    ($/hr)","Fuel Cost           ($/hr)","Labour Cost\n($/hr)","Margin on Labour & Fuel\n($/hr)","Custom Rate                     ($/hr)"]
[]
[]
[{"$f":"DATA!D14","v":"Two Track (350-449 hp)"}]
[null,{"$f":"DATA!F14","v":575000},{"$f":"DATA!AA14","v":63},{"$f":"DATA!AF14","v":89.074054865229186},{"$f":"DATA!AG14","v":42.93333333333333},{"$f":"DATA!AH14","v":19.801108229784379},{"$f":"DATA!AI14","v":152},{"$f":"DATA!AJ14","v":88.199999999999989},{"$f":"DATA!AK14","v":27},{"$f":"DATA!AL14","v":17.279999999999998},{"$f":"DATA!AN14","v":284}]
[]
[{"$f":"DATA!D15","v":"Two Track (450-570 hp)"}]
[null,{"$f":"DATA!F15","v":700000},{"$f":"DATA!AA15","v":80},{"$f":"DATA!AF15","v":108.43797983593119},{"$f":"DATA!AG15","v":52.266666666666666},{"$f":"DATA!AH15","v":24.105696975389677},{"$f":"DATA!AI15","v":185},{"$f":"DATA!AJ15","v":112},{"$f":"DATA!AK15","v":27},{"$f":"DATA!AL15","v":20.849999999999998},{"$f":"DATA!AN15","v":345}]
[]
[{"$f":"DATA!D16","v":"Four Track (400-474 hp)"}]
[null,{"$f":"DATA!F16","v":700000},{"$f":"DATA!AA16","v":100},{"$f":"DATA!AF16","v":108.43797983593119},{"$f":"DATA!AG16","v":52.266666666666666},{"$f":"DATA!AH16","v":24.105696975389677},{"$f":"DATA!AI16","v":185},{"$f":"DATA!AJ16","v":140},{"$f":"DATA!AK16","v":27},{"$f":"DATA!AL16","v":25.05},{"$f":"DATA!AN16","v":377}]
[]
[{"$f":"DATA!D17","v":"Four Track (475-549 hp)"}]
[null,{"$f":"DATA!F17","v":775000},{"$f":"DATA!AA17","v":110},{"$f":"DATA!AF17","v":120.05633481835241},{"$f":"DATA!AG17","v":57.866666666666667},{"$f":"DATA!AH17","v":26.688450222752863},{"$f":"DATA!AI17","v":205},{"$f":"DATA!AJ17","v":154},{"$f":"DATA!AK17","v":27},{"$f":"DATA!AL17","v":27.15},{"$f":"DATA!AN17","v":413}]
[]
[{"$f":"DATA!D18","v":"Four Track (550-650 hp)"}]
[null,{"$f":"DATA!F18","v":850000},{"$f":"DATA!AA18","v":115},{"$f":"DATA!AF18","v":131.67468980077362},{"$f":"DATA!AG18","v":63.466666666666669},{"$f":"DATA!AH18","v":29.271203470116042},{"$f":"DATA!AI18","v":224},{"$f":"DATA!AJ18","v":161},{"$f":"DATA!AK18","v":27},{"$f":"DATA!AL18","v":28.2},{"$f":"DATA!AN18","v":440}]
[]
[{"$f":"\"Annual hours of use: \"&DATA!Y14","v":"Annual hours of use: 450"}]
["Notes:  Fuel type is diesel, with a 75% load assumption. To calculate fuel consumption with alternative load, refer to Appendix E."]
["            Power rating represents engine power."]

{"sheet":"Harvesting Grain- Sp Combines","index":9,"n_rows":29,"n_cols":7,"rows_kept":29,"cut":false,"hidden":true,"merged":[[2,0,2,6],[3,5,5,5],[3,6,5,6],[3,7,5,7],[3,8,5,8],[3,9,5,9],[3,0,5,0],[3,1,5,1],[3,2,5,2],[3,3,5,3],[3,4,5,4]]}
["Harvesting Grain"]
[]
["SP Combines"]
["Machine Size","Purchase Price","Litre / Hour","Ownership Cost                ($/hr)","Repair &\nMaint.\n(R&M) Cost\n($/hr)","Margin on Ownership and R&M\n($/hr)","Rental Rate    ($/hr)"]
[]
[]
[]
["Class 5 Rotary",{"$f":"DATA!F19","v":500000},{"$f":"DATA!AA19","v":43},{"$f":"DATA!AF19","v":169.275324736318},{"$f":"DATA!AG19","v":52.6},{"$f":"DATA!AH19","v":33.2812987104477},{"$f":"DATA!AI19","v":255}]
[{"$f":"DATA!E19","v":"(≤ 300 hp)"}]
[]
["Class 6 Rotary",{"$f":"DATA!F20","v":550000},{"$f":"DATA!AA20","v":51},{"$f":"DATA!AF20","v":186.2028572099498},{"$f":"DATA!AG20","v":57.86},{"$f":"DATA!AH20","v":36.609428581492473},{"$f":"DATA!AI20","v":281}]
[{"$f":"DATA!E20","v":"(301-360 hp)"}]
[]
["Class 7 Rotary",{"$f":"DATA!F21","v":650000},{"$f":"DATA!AA21","v":55},{"$f":"DATA!AF21","v":220.05792215721337},{"$f":"DATA!AG21","v":68.38},{"$f":"DATA!AH21","v":43.265688323582005},{"$f":"DATA!AI21","v":332}]
[{"$f":"DATA!E21","v":"(361-420 hp)"}]
[]
["Class 8 Rotary",{"$f":"DATA!F22","v":750000},{"$f":"DATA!AA22","v":71},{"$f":"DATA!AF22","v":253.91298710447703},{"$f":"DATA!AG22","v":78.900000000000006},{"$f":"DATA!AH22","v":49.92194806567155},{"$f":"DATA!AI22","v":383}]
[{"$f":"DATA!E22","v":"(421-500 hp)"}]
[]
["Class 9 Rotary",{"$f":"DATA!F23","v":850000},{"$f":"DATA!AA23","v":82},{"$f":"DATA!AF23","v":287.7680520517406},{"$f":"DATA!AG23","v":89.42},{"$f":"DATA!AH23","v":56.578207807761089},{"$f":"DATA!AI23","v":434}]
[{"$f":"DATA!E23","v":"(501-560 hp)"}]
[]
["Class 10 Rotary",{"$f":"DATA!F24","v":950000},{"$f":"DATA!AA24","v":90},{"$f":"DATA!AF24","v":321.6231169990042},{"$f":"DATA!AG24","v":99.94},{"$f":"DATA!AH24","v":63.234467549850628},{"$f":"DATA!AI24","v":485}]
[{"$f":"DATA!E24","v":"(561+ hp)"}]
[]
[]
[{"$f":"\"Rotary annual hours of use*: \"&DATA!Y19","v":"Rotary annual hours of use*: 250"}]
["*Based on seperator annual hours of usage."]
["Notes:  Fuel type is diesel, with a 75% load assumption. To calculate fuel consumption with alternative load, refer to Appendix E."]

{"sheet":"Harvest Combine (2)","index":10,"n_rows":41,"n_cols":8,"rows_kept":41,"cut":false,"hidden":true,"merged":[[38,1,38,2],[40,1,40,2],[3,10,5,10],[3,4,5,4],[3,5,5,5],[3,6,5,6],[3,9,5,9],[2,0,2,7],[3,0,5,0],[3,1,5,1],[3,2,5,2],[3,3,5,3],[3,7,5,7]]}
[null,null,null,null,null,null,null,"Harvesting Grain"]
[]
["SP Combines (continued)"]
["Machine Size","Purchase Price","Fuel Cost           ($/hr)","Labour Cost           ($/hr)","Margin on Labour & Fuel\n($/hr)","Custom Rate                     ($/hr)","Work Rate (acre/hr)","Custom Rate                     ($/ac)"]
[]
[]
[]
["Class 5 Rotary",{"$f":"DATA!F19","v":500000},{"$f":"DATA!AJ19","v":60.199999999999996},{"$f":"DATA!AK19","v":27},{"$f":"DATA!AL19","v":13.079999999999998},{"$f":"DATA!AN19","v":355},{"$f":"DATA!AD19","v":8},{"$f":"DATA!AO19","v":44}]
[{"$f":"DATA!E19","v":"(≤ 300 hp)"}]
[]
["Class 6 Rotary",{"$f":"DATA!F20","v":550000},{"$f":"DATA!AJ20","v":71.399999999999991},{"$f":"DATA!AK20","v":27},{"$f":"DATA!AL20","v":14.759999999999998},{"$f":"DATA!AN20","v":394},{"$f":"DATA!AD20","v":10},{"$f":"DATA!AO20","v":39}]
[{"$f":"DATA!E20","v":"(301-360 hp)"}]
[]
["Class 7 Rotary",{"$f":"DATA!F21","v":650000},{"$f":"DATA!AJ21","v":77},{"$f":"DATA!AK21","v":27},{"$f":"DATA!AL21","v":15.6},{"$f":"DATA!AN21","v":452},{"$f":"DATA!AD21","v":12},{"$f":"DATA!AO21","v":38}]
[{"$f":"DATA!E21","v":"(361-420 hp)"}]
[]
["Class 8 Rotary",{"$f":"DATA!F22","v":750000},{"$f":"DATA!AJ22","v":99.399999999999991},{"$f":"DATA!AK22","v":27},{"$f":"DATA!AL22","v":18.959999999999997},{"$f":"DATA!AN22","v":528},{"$f":"DATA!AD22","v":15},{"$f":"DATA!AO22","v":35}]
[{"$f":"DATA!E22","v":"(421-500 hp)"}]
[]
["Class 9 Rotary",{"$f":"DATA!F23","v":850000},{"$f":"DATA!AJ23","v":114.8},{"$f":"DATA!AK23","v":27},{"$f":"DATA!AL23","v":21.27},{"$f":"DATA!AN23","v":597},{"$f":"DATA!AD23","v":17},{"$f":"DATA!AO23","v":35}]
[{"$f":"DATA!E23","v":"(501-560 hp)"}]
[]
["Class 10 Rotary",{"$f":"DATA!F24","v":950000},{"$f":"DATA!AJ24","v":125.99999999999999},{"$f":"DATA!AK24","v":27},{"$f":"DATA!AL24","v":22.95},{"$f":"DATA!AN24","v":661},{"$f":"DATA!AD24","v":21},{"$f":"DATA!AO24","v":31}]
[{"$f":"DATA!E24","v":"(561+ hp)"}]
[]
[]
[{"$f":"\"Rotary annual hours of use*: \"&DATA!Y19","v":"Rotary annual hours of use*: 250"}]
["*Based on seperator annual hours of usage. Does not include header."]
["Notes:  Fuel type is diesel, with a 75% load assumption. To calculate fuel consumption with alternative load, refer to Appendix E."]
[]
[]
["Calculation to determine the custom rate ($/acre) for a combine using a specific combine header:"]
[]
["Custom Rate ($/acre)  =  Combine Custom Rate ($/hr)  +  Header Rental Rate ($/hr)"]
["   ",null," Work Rate (acre/hr)"]
[]
["Example: For a Class 8 rotary combine with a 35 ft flex auger header:"]
[]
["Custom Rate ($/acre)  =  ",{"$f":"'Harvesting Grain CombineHeaders'!B44","v":"$528 + $35"}]
[null,{"$f":"'Harvesting Grain CombineHeaders'!B45","v":15}]
["Custom Rate ($/acre)  =  ",{"$f":"'Harvesting Grain CombineHeaders'!B46","v":"$38/acre"}]

{"sheet":"Harvesting Grain CombineHeaders","index":11,"n_rows":46,"n_cols":7,"rows_kept":46,"cut":false,"hidden":true,"merged":[[43,1,43,2],[44,1,44,2],[45,1,45,2],[17,1,17,2],[8,1,8,2],[18,1,18,2],[19,1,19,2],[26,1,26,2],[12,1,12,2],[16,1,16,2],[11,1,11,2],[13,1,13,2],[20,1,20,2],[21,1,21,2],[23,1,23,2],[24,1,24,2],[25,1,25,2],[22,1,22,2],[14,1,14,2],[1,76,3,76],[2,27,2,29],[3,27,3,29],[9,1,9,2],[8,27,8,29],[2,0,2,6],[3,0,5,0],[3,1,5,2],[3,3,5,3],[3,4,5,4],[3,5,5,5],[3,6,5,6],[6,1,6,2],[7,1,7,2],[15,1,15,2],[1,27,1,29],[1,75,3,75],[4,27,4,29],[5,27,5,29],[10,1,10,2],[7,27,7,29],[9,27,9,29],[6,27,6,29]]}
["Harvesting Grain"]
[]
["Combine Headers"]
["Machine Size","Purchase Price",null,"Ownership\nCost\n($/hr)","Repair & Maint.\n(R&M) Cost\n($/hr)","Margin on\nOwnership\nand R&M\n($/hr)","Rental Rate    ($/hr)"]
[]
[]
["Pickup Headers"]
[{"$f":"DATA!E25","v":"15 FT"},{"$f":"DATA!F25","v":39000},null,{"$f":"DATA!AF25","v":8.5460851976596821},{"$f":"DATA!AG25","v":2.4648000000000003},{"$f":"DATA!AH25","v":1.6516327796489523},{"$f":"DATA!AI25","v":13}]
["Rigid Draper Headers "]
[{"$f":"DATA!E26","v":"30 FT"},{"$f":"DATA!F26","v":110000},null,{"$f":"DATA!AF26","v":24.104342865193978},{"$f":"DATA!AG26","v":9.24},{"$f":"DATA!AH26","v":5.0016514297790966},{"$f":"DATA!AI26","v":38}]
[{"$f":"DATA!E27","v":"35 FT"},{"$f":"DATA!F27","v":125000},null,{"$f":"DATA!AF27","v":27.391298710447703},{"$f":"DATA!AG27","v":10.5},{"$f":"DATA!AH27","v":5.6836948065671544},{"$f":"DATA!AI27","v":44}]
[{"$f":"DATA!E28","v":"40 FT"},{"$f":"DATA!F28","v":140000},null,{"$f":"DATA!AF28","v":30.678254555701422},{"$f":"DATA!AG28","v":11.76},{"$f":"DATA!AH28","v":6.3657381833552131},{"$f":"DATA!AI28","v":49}]
["Flex Auger Headers"]
[{"$f":"DATA!E29","v":"25 FT"},{"$f":"DATA!F29","v":60000},null,{"$f":"DATA!AF29","v":16.730431174686526},{"$f":"DATA!AG29","v":6.3120000000000003},{"$f":"DATA!AH29","v":3.4563646762029792},{"$f":"DATA!AI29","v":26}]
[{"$f":"DATA!E30","v":"30 FT"},{"$f":"DATA!F30","v":70000},null,{"$f":"DATA!AF30","v":19.518836370467614},{"$f":"DATA!AG30","v":7.3639999999999999},{"$f":"DATA!AH30","v":4.0324254555701424},{"$f":"DATA!AI30","v":31}]
[{"$f":"DATA!E31","v":"35 FT"},{"$f":"DATA!F31","v":80000},null,{"$f":"DATA!AF31","v":22.307241566248699},{"$f":"DATA!AG31","v":8.4160000000000004},{"$f":"DATA!AH31","v":4.6084862349373044},{"$f":"DATA!AI31","v":35}]
["Flex Draper Headers "]
[{"$f":"DATA!E32","v":"30 FT"},{"$f":"DATA!F32","v":125000},null,{"$f":"DATA!AF32","v":34.8550649472636},{"$f":"DATA!AG32","v":14.7},{"$f":"DATA!AH32","v":7.4332597420895397},{"$f":"DATA!AI32","v":57}]
[{"$f":"DATA!E33","v":"35 FT"},{"$f":"DATA!F33","v":140000},null,{"$f":"DATA!AF33","v":39.037672740935228},{"$f":"DATA!AG33","v":16.463999999999999},{"$f":"DATA!AH33","v":8.3252509111402837},{"$f":"DATA!AI33","v":64}]
[{"$f":"DATA!E34","v":"40 FT"},{"$f":"DATA!F34","v":150000},null,{"$f":"DATA!AF34","v":41.826077936716317},{"$f":"DATA!AG34","v":17.64},{"$f":"DATA!AH34","v":8.9199116905074476},{"$f":"DATA!AI34","v":68}]
[{"$f":"DATA!E35","v":"45 FT"},{"$f":"DATA!F35","v":160000},null,{"$f":"DATA!AF35","v":44.614483132497398},{"$f":"DATA!AG35","v":18.815999999999999},{"$f":"DATA!AH35","v":9.5145724698746097},{"$f":"DATA!AI35","v":73}]
[{"$f":"DATA!E36","v":"50 FT"},{"$f":"DATA!F36","v":185000},null,{"$f":"DATA!AF36","v":51.585496121950122},{"$f":"DATA!AG36","v":21.756},{"$f":"DATA!AH36","v":11.001224418292518},{"$f":"DATA!AI36","v":84}]
["Corn Header"]
[{"$f":"DATA!D37","v":"Corn (6 row, 30\" spacing)"},{"$f":"DATA!F37","v":85000},null,{"$f":"DATA!AF37","v":59.253610410348109},{"$f":"DATA!AG37","v":24.99},{"$f":"DATA!AH37","v":12.636541561552216},{"$f":"DATA!AI37","v":97}]
[{"$f":"DATA!D38","v":"Corn (8 row, 30\" spacing)"},{"$f":"DATA!F38","v":115000},null,{"$f":"DATA!AF38","v":80.166649378706268},{"$f":"DATA!AG38","v":33.81},{"$f":"DATA!AH38","v":17.096497406805941},{"$f":"DATA!AI38","v":131}]
[{"$f":"DATA!D39","v":"Corn (12 row folding, 30\" spacing)"},{"$f":"DATA!F39","v":180000},null,{"$f":"DATA!AF39","v":125.47823381014894},{"$f":"DATA!AG39","v":52.92},{"$f":"DATA!AH39","v":26.759735071522343},{"$f":"DATA!AI39","v":205}]
[{"$f":"DATA!D40","v":"Corn (16-18 row folding , 30\" spacing)"},{"$f":"DATA!F40","v":245000},null,{"$f":"DATA!AF40","v":170.7898182415916},{"$f":"DATA!AG40","v":72.03},{"$f":"DATA!AH40","v":36.422972736238741},{"$f":"DATA!AI40","v":279}]
[]
[{"$f":"\"Pickup header annual hours of use: \"&DATA!Y25","v":"Pickup header annual hours of use: 250"}]
[{"$f":"\"Rigid draper header annual hours of use: \"&DATA!Y26","v":"Rigid draper header annual hours of use: 250"}]
[{"$f":"\"Flex auger header annual hours of use: \"&DATA!Y29","v":"Flex auger header annual hours of use: 250"}]
[{"$f":"\"Flex draper header annual hours of use: \"&DATA!Y31","v":"Flex draper header annual hours of use: 250"}]
[{"$f":"\"Corn header annual hours of use: \"&DATA!Y37","v":"Corn header annual hours of use: 100"}]
["Rigid, flex, and draper headers include pickup reels."]
[]
[]
["Calculation to determine the custom rate ($/acre) for a combine using a specific combine header:"]
[]
["Custom Rate ($/acre)  =  Combine Custom Rate ($/hr)  +  Header Rental Rate ($/hr)"]
["   ",null," Work Rate (acre/hr)"]
[]
["Example: For a Class 8 rotary combine with a 35 ft flex auger header:"]
[]
["Custom Rate ($/acre)  =  ",{"$f":"\"$\"&DATA!AN22&\" + $\"&DATA!AI31","v":"$528 + $35"}]
[null,{"$f":"'Harvest Combine (2)'!G17","v":15}]
["Custom Rate ($/acre)  =  ",{"$f":"\"$\"&ROUND((DATA!AN22+DATA!AI31)/'Harvest Combine (2)'!G17,0)&\"/acre\"","v":"$38/acre"}]

{"sheet":"Harvesting Grain Swathers","index":12,"n_rows":50,"n_cols":8,"rows_kept":50,"cut":false,"hidden":true,"merged":[[16,7,18,7],[3,5,5,5],[3,6,5,6],[3,7,5,7],[2,0,2,7],[15,0,15,7],[3,0,5,0],[3,1,5,1],[3,2,5,2],[3,3,5,3],[3,4,5,4],[32,5,34,5],[32,6,34,6],[32,7,34,7],[31,0,31,7],[16,0,18,0],[16,1,18,1],[16,2,18,2],[16,3,18,3],[32,0,34,0],[32,1,34,1],[32,2,34,2],[32,3,34,3],[32,4,34,4],[16,4,18,4],[16,5,18,5],[16,6,18,6]]}
[null,null,null,null,null,null,null,"Harvesting Grain"]
[]
["Swathers"]
["Machine Size","Purchase Price","Litre / Hour","Ownership Cost\n($/hr)","Repair & Maint.\n(R&M) Cost\n($/hr)","Margin on\nOwnership\nand R&M\n($/hr)","Rental Rate    ($/hr)","Fuel Cost           ($/hr)"]
[]
[]
["SP Swathers - Draper Header"]
[{"$f":"DATA!D41","v":"25 FT"},{"$f":"DATA!F41","v":225000},{"$f":"DATA!AA41","v":22},{"$f":"DATA!AF41","v":78.423896131343099},{"$f":"DATA!AG41","v":23.625},{"$f":"DATA!AH41","v":15.307334419701464},{"$f":"DATA!AI41","v":117},{"$f":"DATA!AJ41","v":30.799999999999997}]
[{"$f":"DATA!D42","v":"30 FT"},{"$f":"DATA!F42","v":265000},{"$f":"DATA!AA42","v":32},{"$f":"DATA!AF42","v":92.365922110248519},{"$f":"DATA!AG42","v":27.824999999999999},{"$f":"DATA!AH42","v":18.028638316537279},{"$f":"DATA!AI42","v":138},{"$f":"DATA!AJ42","v":44.8}]
[{"$f":"DATA!D43","v":"35 FT"},{"$f":"DATA!F43","v":295000},{"$f":"DATA!AA43","v":36},{"$f":"DATA!AF43","v":102.8224415944276},{"$f":"DATA!AG43","v":30.975000000000001},{"$f":"DATA!AH43","v":20.069616239164137},{"$f":"DATA!AI43","v":154},{"$f":"DATA!AJ43","v":50.4}]
[{"$f":"DATA!D44","v":"40 FT"},{"$f":"DATA!F44","v":300000},{"$f":"DATA!AA44","v":36},{"$f":"DATA!AF44","v":104.5651948417908},{"$f":"DATA!AG44","v":31.5},{"$f":"DATA!AH44","v":20.409779226268618},{"$f":"DATA!AI44","v":156},{"$f":"DATA!AJ44","v":50.4}]
[]
[]
[]
[]
["Swathers (continued)"]
["Machine Size","Purchase Price","Litre / Hour","Labour Cost           ($/hr)","Margin on Labour & Fuel\n($/hr)","Custom Rate                     ($/hr)","Work Rate (acre/hr)","Custom Rate ($/acre)"]
[]
[]
["SP Swathers - Draper Header"]
[{"$f":"A8","v":"25 FT"},{"$f":"DATA!F41","v":225000},{"$f":"DATA!AA41","v":22},{"$f":"DATA!AK41","v":27},{"$f":"DATA!AL41","v":8.67},{"$f":"DATA!AN41","v":183},{"$f":"DATA!AD41","v":13},{"$f":"DATA!AO41","v":14}]
[{"$f":"A9","v":"30 FT"},{"$f":"DATA!F42","v":265000},{"$f":"DATA!AA42","v":32},{"$f":"DATA!AK42","v":27},{"$f":"DATA!AL42","v":10.77},{"$f":"DATA!AN42","v":221},{"$f":"DATA!AD42","v":16},{"$f":"DATA!AO42","v":14}]
[{"$f":"A10","v":"35 FT"},{"$f":"DATA!F43","v":295000},{"$f":"DATA!AA43","v":36},{"$f":"DATA!AK43","v":27},{"$f":"DATA!AL43","v":11.610000000000001},{"$f":"DATA!AN43","v":243},{"$f":"DATA!AD43","v":19},{"$f":"DATA!AO43","v":13}]
[{"$f":"A11","v":"40 FT"},{"$f":"DATA!F44","v":300000},{"$f":"DATA!AA44","v":36},{"$f":"DATA!AK44","v":27},{"$f":"DATA!AL44","v":11.610000000000001},{"$f":"DATA!AN44","v":245},{"$f":"DATA!AD44","v":21},{"$f":"DATA!AO44","v":12}]
[]
[]
[{"$f":"\"Annual hours of use: \"&DATA!Y41","v":"Annual hours of use: 200"}]
["Notes:  Fuel type is diesel with a 75% load assumption. To calculate fuel consumption with alternative load, refer to Appendix E."]
["            Fuel efficiency is based on 126 hp (18-22' swather), 126 hp (25' swather), 190 hp (30' swather), and 226 hp (35'+ swather)."]
[]
[]
["Grain Cart"]
["Machine Size","Purchase Price","Ownership Cost\n($/hr)","Repair & Maint.\n(R&M) Cost\n($/hr)","Margin on\nOwnership\nand R&M\n($/hr)","Rental Rate    ($/hr)","Power Unit\nCost\n($/hr)","Custom Rate                     ($/hr)"]
[]
[]
["Small"]
[{"$f":"DATA!E45","v":"1,000 bu"},{"$f":"DATA!F45","v":100000},{"$f":"DATA!AF45","v":21.913038968358158},{"$f":"DATA!AG45","v":8.4},{"$f":"DATA!AH45","v":4.5469558452537235},{"$f":"DATA!AI45","v":35},{"$f":"DATA!AM45","v":279},{"$f":"DATA!AN45","v":314}]
[null,null,null,null,null,null,"(350 hp)"]
["Medium"]
[{"$f":"DATA!E46","v":"1,400 bu"},{"$f":"DATA!F46","v":220000},{"$f":"DATA!AF46","v":48.208685730387955},{"$f":"DATA!AG46","v":18.48},{"$f":"DATA!AH46","v":10.003302859558193},{"$f":"DATA!AI46","v":77},{"$f":"DATA!AM46","v":319},{"$f":"DATA!AN46","v":396}]
[null,null,null,null,null,null,"(450 hp)"]
["Large"]
[{"$f":"DATA!E47","v":"2,000 bu"},{"$f":"DATA!F47","v":310000},{"$f":"DATA!AF47","v":67.930420801910287},{"$f":"DATA!AG47","v":26.04},{"$f":"DATA!AH47","v":14.095563120286542},{"$f":"DATA!AI47","v":108},{"$f":"DATA!AM47","v":351},{"$f":"DATA!AN47","v":459}]
[null,null,null,null,null,null,"(550+ hp)"]
[]
[{"$f":"\"Annual hours of use: \"&DATA!Y45","v":"Annual hours of use: 250"}]
["Notes:  Power unit cost includes fuel, labour, and margin. "]
["            The power unit for the medium large grain cart is a 4WD tractor."]
[{"$f":"\"            To obtain a total cost for grain cart, power unit, and fuel (but not labour), subtract $\"&TEXT(DATA!AK44+(Labour*Margin_percentage),\"#.00\")&\" from the Custom Rate ($\"&Labour&\"/hr\"","v":"            To obtain a total cost for grain cart, power unit, and fuel (but not labour), subtract $31.05 from the Custom Rate ($27/hr"}]
[{"$f":"\"            labour plus \"&Margin_percentage*100&\"% margin).\"","v":"            labour plus 15% margin)."}]

{"sheet":"Harvesting Grain Power Auger","index":13,"n_rows":48,"n_cols":9,"rows_kept":48,"cut":false,"hidden":true,"merged":[[3,81,5,81],[4,32,4,34],[5,32,5,34],[12,32,12,34],[9,32,9,34],[10,32,10,34],[11,32,11,34],[6,32,6,34],[7,32,7,34],[8,32,8,34],[3,80,5,80],[2,31,2,34],[3,32,3,34],[3,4,5,4],[3,5,5,5],[3,8,5,8],[3,6,5,7],[2,0,2,8],[3,3,5,3],[3,0,5,2],[21,31,21,34],[22,31,22,33],[22,79,24,79],[22,80,24,80],[23,31,23,33],[24,31,24,33],[31,31,31,33],[28,31,28,33],[29,31,29,33],[30,31,30,33],[25,31,25,33],[26,31,26,33],[27,31,27,33],[47,0,48,8],[36,0,36,8],[23,1,23,2],[25,1,25,2],[24,1,24,2],[29,1,29,2],[28,1,28,2],[27,1,27,2],[26,1,26,2],[45,0,46,8],[42,1,42,2],[37,8,39,8],[40,1,40,2],[37,1,39,2],[41,1,41,2],[37,0,39,0],[43,1,43,2],[37,7,39,7],[20,1,20,2],[21,1,21,2],[22,1,22,2],[37,3,39,3],[37,4,39,4],[37,5,39,5],[37,6,39,6],[11,6,11,7],[16,0,16,8],[31,0,32,8],[33,0,34,8],[17,0,19,0],[17,1,19,2],[17,3,19,3],[17,4,19,4],[17,5,19,5],[17,6,19,6],[17,7,19,7],[17,8,19,8],[11,0,12,2],[20,0,21,0],[22,0,23,0],[24,0,25,0],[6,6,6,7],[7,6,7,7],[8,6,8,7],[9,6,9,7],[10,6,10,7],[26,0,27,0],[28,0,29,0],[6,0,6,2],[7,0,7,2],[8,0,8,2],[9,0,9,2],[10,0,10,2]]}
["Harvesting Grain"]
[]
["Powered Auger"]
["Machine Size",null,null,"Purchase Price","Ownership Cost                ($/hr)","Repair & Maint.\n(R&M) Cost\n($/hr)","Margin on\nOwnership and R&M\n($/hr)",null,"Rental Rate    ($/hr)"]
[]
[]
[{"$f":"DATA!D48","v":"8 in. (30-39 FT, 20 hp engine)"},null,null,{"$f":"DATA!F48","v":23000},{"$f":"DATA!AF48","v":12.59999740680594},{"$f":"DATA!AG48","v":3.6340000000000003},{"$f":"DATA!AH48","v":2.4350996110208909},null,{"$f":"DATA!AI48","v":19}]
[{"$f":"DATA!D49","v":"8 in. (40-49 FT, 20 hp engine)"},null,null,{"$f":"DATA!F49","v":24000},{"$f":"DATA!AF49","v":13.147823381014897},{"$f":"DATA!AG49","v":3.7920000000000003},{"$f":"DATA!AH49","v":2.5409735071522346},null,{"$f":"DATA!AI49","v":19}]
[{"$f":"DATA!D50","v":"8 in. (50-59 FT, 25 hp engine)"},null,null,{"$f":"DATA!F50","v":25000},{"$f":"DATA!AF50","v":13.69564935522385},{"$f":"DATA!AG50","v":3.9500000000000006},{"$f":"DATA!AH50","v":2.6468474032835774},null,{"$f":"DATA!AI50","v":20}]
[{"$f":"DATA!D51","v":"10 in. (40-49 FT, 35 hp engine)"},null,null,{"$f":"DATA!F51","v":27000},{"$f":"DATA!AF51","v":14.791301303641756},{"$f":"DATA!AG51","v":4.266},{"$f":"DATA!AH51","v":2.8585951955462634},null,{"$f":"DATA!AI51","v":22}]
[{"$f":"DATA!D52","v":"10 in. (50-59 FT, 38 hp engine)"},null,null,{"$f":"DATA!F52","v":31000},{"$f":"DATA!AF52","v":16.982605200477572},{"$f":"DATA!AG52","v":4.8980000000000006},{"$f":"DATA!AH52","v":3.2820907800716355},null,{"$f":"DATA!AI52","v":25}]
[{"$f":"DATA!D53","v":"12-13 in. u trough (39-40 FT, 38-50 hp engine)"},null,null,{"$f":"DATA!F53","v":38000},{"$f":"DATA!AF53","v":20.817387019940252},{"$f":"DATA!AG53","v":6.0040000000000013},{"$f":"DATA!AH53","v":4.0232080529910377},null,{"$f":"DATA!AI53","v":31}]
[]
[{"$f":"\"Annual hours of use: \"&DATA!Y48","v":"Annual hours of use: 100"}]
["Notes:  Value of engine is included in rental rate.  Rate does not include fuel or maintenance costs for engine."]
[]
["Grain Auger (PTO)"]
["Machine Size","Purchase Price",null,"Ownership Cost                ($/hr)","Repair & Maint.\n(R&M) Cost\n($/hr)","Margin on\nOwnership\nand R&M\n($/hr)","Rental Rate    ($/hr)","Power Unit\nCost\n($/hr)","Custom Rate ($/hr)"]
[]
[]
[{"$f":"DATA!E54","v":"8\" 30-69 FT\n2,700-3,200 bu/hr"},{"$f":"DATA!F54","v":12000},null,{"$f":"DATA!AF54","v":6.5739116905074484},{"$f":"DATA!AG54","v":1.2600000000000002},{"$f":"DATA!AH54","v":1.1750867535761174},{"$f":"DATA!AI54","v":9},{"$f":"DATA!AM54","v":135},{"$f":"DATA!AN54","v":144}]
[null,null,null,null,null,null,null,"(50 hp)"]
[{"$f":"DATA!E55","v":"10\" 40-89 FT\n5,400 bu/hr"},{"$f":"DATA!F55","v":25000},null,{"$f":"DATA!AF55","v":13.69564935522385},{"$f":"DATA!AG55","v":2.625},{"$f":"DATA!AH55","v":2.4480974032835774},{"$f":"DATA!AI55","v":19},{"$f":"DATA!AM55","v":135},{"$f":"DATA!AN55","v":154}]
[null,null,null,null,null,null,null,"(75 hp)"]
[{"$f":"DATA!E56","v":"13\" 70-100 FT\n9,700 bu/hr"},{"$f":"DATA!F56","v":55000},null,{"$f":"DATA!AF56","v":30.130428581492467},{"$f":"DATA!AG56","v":5.7750000000000004},{"$f":"DATA!AH56","v":5.3858142872238695},{"$f":"DATA!AI56","v":41},{"$f":"DATA!AM56","v":135},{"$f":"DATA!AN56","v":176}]
[null,null,null,null,null,null,null,"(100 hp)"]
[{"$f":"DATA!E57","v":"16\" 80-100 FT\n21,000 bu/hr"},{"$f":"DATA!F57","v":90000},null,{"$f":"DATA!AF57","v":49.304337678805858},{"$f":"DATA!AG57","v":9.4500000000000011},{"$f":"DATA!AH57","v":8.8131506518208784},{"$f":"DATA!AI57","v":68},{"$f":"DATA!AM57","v":176},{"$f":"DATA!AN57","v":244}]
[null,null,null,null,null,null,null,"(200 hp)"]
[{"$f":"DATA!E58","v":"16\" 100+ FT\n21,000 bu/hr"},{"$f":"DATA!F58","v":125000},null,{"$f":"DATA!AF58","v":68.478246776119249},{"$f":"DATA!AG58","v":13.125},{"$f":"DATA!AH58","v":12.240487016417887},{"$f":"DATA!AI58","v":94},{"$f":"DATA!AM58","v":176},{"$f":"DATA!AN58","v":270}]
[null,null,null,null,null,null,null,"(200 hp)"]
[{"$f":"\"Annual hours of use: \"&DATA!Y54","v":"Annual hours of use: 100"}]
["Notes:  The power units for all PTO augers are front wheel assist tractors. Note that the smallest front wheel assist tractor available in this guide is 100 hp, so power unit cost for equipment that requires a smaller power unit may be over-estimated."]
[]
[{"$f":"\"Power unit cost includes fuel, labour, and margin. To obtain a total cost for auger, power unit, and fuel (but not labour), subtract $\"&TEXT(Labour+(Labour*Margin_percentage),\"#.00\")&\" from the Custom Rate ($\"&Labour&\"/hr labour plus \"&Margin_percentage*100&\"% margin).\"","v":"Power unit cost includes fuel, labour, and margin. To obtain a total cost for auger, power unit, and fuel (but not labour), subtract $31.05 from the Custom Rate ($27/hr labour plus 15% margin)."}]
[]
[]
["Grain Vac"]
["Machine Size","Purchase Price",null,"Ownership Cost                ($/hr)","Repair & Maint.\n(R&M) Cost\n($/hr)","Margin on\nOwnership\nand R&M\n($/hr)","Rental Rate    ($/hr)","Power Unit\nCost\n($/hr)","Custom Rate ($/hr)"]
[]
[]
[{"$f":"DATA!E72","v":"2,400-5,000 bu/hr"},{"$f":"DATA!F72","v":45000},null,{"$f":"DATA!AF72","v":62.739116905074468},{"$f":"DATA!AG72","v":18.900000000000002},{"$f":"DATA!AH72","v":12.245867535761171},{"$f":"DATA!AI72","v":94},{"$f":"DATA!AM72","v":116},{"$f":"DATA!AN72","v":210}]
[null,null,null,null,null,null,null,"(70 hp)"]
[{"$f":"DATA!E73","v":"6,000-10,000 bu/hr"},{"$f":"DATA!F73","v":65000},null,{"$f":"DATA!AF73","v":90.623168862885336},{"$f":"DATA!AG73","v":27.3},{"$f":"DATA!AH73","v":17.688475329432798},{"$f":"DATA!AI73","v":136},{"$f":"DATA!AM73","v":127},{"$f":"DATA!AN73","v":263}]
[null,null,null,null,null,null,null,"(120 hp)"]
[{"$f":"\"Annual hours of use: \"&DATA!Y72","v":"Annual hours of use: 50"}]
["Notes: The power units for all grain vacs are two-wheel drive tractors. Note that the smallest two-wheel drive tractor available in this guide is 100 hp, so power unit cost for equipment that requires a smaller power unit may be over-estimated.  "]
[]
[{"$f":"\"Power unit cost includes fuel, labour, and margin. To obtain a total cost for auger, power unit, and fuel (but not labour), subtract $\"&TEXT(Labour+(Labour*Margin_percentage),\"#.00\")&\" from the Custom Rate ($\"&Labour&\"/hr labour plus \"&Margin_percentage*100&\"% margin).\"","v":"Power unit cost includes fuel, labour, and margin. To obtain a total cost for auger, power unit, and fuel (but not labour), subtract $31.05 from the Custom Rate ($27/hr labour plus 15% margin)."}]

{"sheet":"Harvesting Hay- SP Forage ","index":14,"n_rows":58,"n_cols":11,"rows_kept":58,"cut":false,"hidden":true,"merged":[[2,0,2,10],[19,0,19,10],[20,0,22,1],[23,2,23,3],[25,2,25,3],[20,10,22,10],[20,9,22,9],[20,8,22,8],[3,8,5,8],[3,0,5,0],[3,5,5,5],[3,3,5,3],[3,9,5,9],[43,0,43,10],[3,4,5,4],[44,9,46,9],[44,5,46,5],[3,10,5,10],[3,1,5,1],[44,8,46,8],[20,5,22,5],[44,4,46,4],[38,2,38,3],[39,2,39,3],[40,2,40,3],[51,0,52,0],[44,10,46,10],[44,1,46,2],[48,1,48,2],[49,1,49,2],[47,1,47,2],[50,1,50,2],[44,0,46,0],[52,1,52,2],[44,3,46,3],[44,6,46,6],[54,1,54,2],[54,0,55,0],[3,2,5,2],[3,6,5,6],[3,7,5,7],[27,2,27,3],[20,6,22,7],[23,6,23,7],[25,6,25,7],[27,6,27,7],[20,2,22,3],[20,4,22,4],[55,1,55,2],[53,1,53,2],[51,1,51,2],[44,7,46,7]]}
[null,null,null,null,null,null,null,null,null,null,"Harvesting Hay"]
[]
["SP Forage Harvester"]
["Machine Size","Purchase Price","Litre / Hour","Ownership Cost                ($/hr)","Repair & Maint.\n(R&M) Cost\n($/hr)","Margin on\nOwnership\nand R&M\n($/hr)","Rental Rate    ($/hr)","Fuel Cost           ($/hr)","Labour Cost           ($/hr)","Margin on Labour & Fuel\n($/hr)","Custom Rate                     ($/hr)"]
[]
[]
["Small"]
[{"$f":"DATA!E74","v":"400-599 hp"},{"$f":"DATA!F74","v":525000},{"$f":"AVERAGE(73,85)","v":79},{"$f":"DATA!AF74","v":130.67931822985042},{"$f":"DATA!AG74","v":110.25},{"$f":"DATA!AH74","v":36.139397734477562},{"$f":"DATA!AI74","v":277},{"$f":"DATA!AJ74","v":110.6},{"$f":"DATA!AK74","v":27},{"$f":"DATA!AL74","v":20.639999999999997},{"$f":"DATA!AN74","v":435}]
[]
["Medium "]
[{"$f":"DATA!E75","v":"600-799 hp"},{"$f":"DATA!F75","v":675000},{"$f":"DATA!AA75","v":103},{"$f":"DATA!AF75","v":168.01626629552194},{"$f":"DATA!AG75","v":141.75},{"$f":"DATA!AH75","v":46.464939944328293},{"$f":"DATA!AI75","v":356},{"$f":"DATA!AJ75","v":144.19999999999999},{"$f":"DATA!AK75","v":27},{"$f":"DATA!AL75","v":25.679999999999996},{"$f":"DATA!AN75","v":553}]
[]
["Large"]
[{"$f":"DATA!E76","v":"800-899 hp"},{"$f":"DATA!F76","v":750000},{"$f":"DATA!AA76","v":121},{"$f":"DATA!AF76","v":186.68474032835775},{"$f":"DATA!AG76","v":157.50000000000003},{"$f":"DATA!AH76","v":51.627711049253662},{"$f":"DATA!AI76","v":396},{"$f":"DATA!AJ76","v":169.39999999999998},{"$f":"DATA!AK76","v":27},{"$f":"DATA!AL76","v":29.459999999999994},{"$f":"DATA!AN76","v":622}]
[]
[{"$f":"\"Annual hours of use: \"&DATA!Y74","v":"Annual hours of use: 400"}]
["Notes:  Fuel type is diesel, with a 75% load assumption. To calculate fuel consumption with alternative load, refer to Appendix E."]
[]
[]
["Headers for SP Forage Harvester"]
["Machine Size",null,"Purchase Price",null,"Ownership Cost                ($/hr)","Repair & Maint.\n(R&M) Cost\n($/hr)","Margin on\nOwnership\nand R&M\n($/hr)",null,"Rental Rate                     ($/acre)","Work Rate (acre/hr)","Rental Rate    ($/hr)"]
[]
[]
["Windrow Pickup,",null,{"$f":"DATA!F77","v":60000},null,{"$f":"DATA!AF77","v":14.934779226268615},{"$f":"DATA!AG77","v":12.6},{"$f":"DATA!AH77","v":4.1302168839402924},null,{"$f":"DATA!AQ77","v":2},{"$f":"DATA!AD77","v":17},{"$f":"DATA!AI77","v":32}]
[{"$f":"DATA!E77","v":"12-17 FT"}]
[{"$f":"DATA!D78","v":"Corn (14-20 FT width)"},null,{"$f":"DATA!F78","v":175000},null,{"$f":"DATA!AF78","v":43.559772743283474},{"$f":"DATA!AG78","v":36.750000000000007},{"$f":"DATA!AH78","v":12.04646591149252},null,{"$f":"DATA!AQ78","v":10},{"$f":"DATA!AD78","v":9},{"$f":"DATA!AI78","v":92}]
[]
[{"$f":"DATA!D79","v":"Corn (21-30 FT width)"},null,{"$f":"DATA!F79","v":225000},null,{"$f":"DATA!AF79","v":56.005422098507317},{"$f":"DATA!AG79","v":47.25},{"$f":"DATA!AH79","v":15.488313314776098},null,{"$f":"DATA!AQ79","v":9.25},{"$f":"DATA!AD79","v":13},{"$f":"DATA!AI79","v":119}]
[]
[{"$f":"\"Annual hours of use: \"&DATA!Y77","v":"Annual hours of use: 400"}]
[]
["Calculation to determine the custom rate ($/acre) for an SP or PT forage harvester using a specific header:"]
[]
["Custom Rate ($/acre)  =  Forage Harvester Custom Rate ($/hr)  +  Header Rental Rate ($/hr)"]
["   ",null,"                                    Work Rate (acre/hr)"]
[]
["Example: For a 700 hp SP Forage Harvester with a corn header:"]
[]
[null,"Custom Rate ($/acre)  =  ",{"$f":"\"$\"&K11&\" + $\"&K26","v":"$553 + $92"}]
[null,null,{"$f":"J26","v":9}]
[null,"     =    ",{"$f":"\"$\"&ROUND((K11+K26)/J26,0)&\" /acre\"","v":"$72 /acre"}]
[]
[]
["Hay Rakes"]
["Machine Size","Purchase Price",null,"Ownership Cost                ($/hr)","Repair & Maint.\n(R&M) Cost\n($/hr)","Margin on\nOwnership\nand R&M\n($/hr)","Rental Rate    ($/hr)","Power Unit Cost ($/hr)","Custom Rate                     ($/hr)","Work Rate (acre/hr)","Custom Rate ($/acre)"]
[]
[]
[]
[{"$f":"DATA!E95","v":"16-20 FT bar"},{"$f":"DATA!F95","v":15000},null,{"$f":"DATA!AF95","v":16.434779226268617},{"$f":"DATA!AG95","v":6.3},{"$f":"DATA!AH95","v":3.4102168839402927},{"$f":"DATA!AI95","v":26},{"$f":"DATA!AM95","v":116},{"$f":"DATA!AN95","v":142},{"$f":"DATA!AD95","v":10},{"$f":"DATA!AO95","v":14}]
[null,null,null,null,null,null,null,"(50 hp)"]
[]
[{"$f":"DATA!E96","v":"21-30 FT wheel"},{"$f":"DATA!F96","v":30000},null,{"$f":"DATA!AF96","v":32.869558452537234},{"$f":"DATA!AG96","v":12.6},{"$f":"DATA!AH96","v":6.8204337678805853},{"$f":"DATA!AI96","v":52},{"$f":"DATA!AM96","v":116},{"$f":"DATA!AN96","v":168},{"$f":"DATA!AD96","v":13},{"$f":"DATA!AO96","v":13}]
[null,null,null,null,null,null,null,"(50 hp)"]
[]
[{"$f":"DATA!E97","v":"31-40 FT wheel"},{"$f":"DATA!F97","v":45000},null,{"$f":"DATA!AF97","v":49.304337678805858},{"$f":"DATA!AG97","v":18.900000000000002},{"$f":"DATA!AH97","v":10.230650651820879},{"$f":"DATA!AI97","v":78},{"$f":"DATA!AM97","v":116},{"$f":"DATA!AN97","v":194},{"$f":"DATA!AD97","v":20},{"$f":"DATA!AO97","v":9.75}]
[null,null,null,null,null,null,null,"(50 hp)"]
[{"$f":"\"Annual hours of use: \"&DATA!Y95","v":"Annual hours of use: 50"}]
["Notes:  Power unit cost includes fuel, labour and margin for two wheel drive tractor."]

{"sheet":"Harvesting Hay SP Mower","index":15,"n_rows":47,"n_cols":10,"rows_kept":47,"cut":false,"hidden":true,"merged":[[46,0,48,9],[3,0,5,2],[12,0,14,2],[11,0,11,9],[2,0,2,9],[25,1,27,1],[24,0,24,9],[25,5,27,5],[25,6,27,6],[25,7,27,7],[25,8,27,8],[25,9,27,9],[25,0,27,0],[25,2,27,2],[25,3,27,3],[25,4,27,4],[12,3,14,3],[12,4,14,4],[3,3,5,3],[3,4,5,4],[3,5,5,5],[3,8,5,8],[3,9,5,9],[12,5,14,5],[12,6,14,6],[12,7,14,7],[12,8,14,8],[12,9,14,9],[3,6,5,6],[3,7,5,7]]}
["Harvesting Hay"]
[]
["SP Mower/Conditioners"]
["Machine Size",null,null,"Purchase Price","Litre / Hour","Ownership Cost                ($/hr)","Repair & Maint.\n(R&M) Cost\n($/hr)","Margin on\nOwnership\nand R&M\n($/hr)","Rental Rate    ($/hr)","Fuel Cost           ($/hr)"]
[]
[]
[{"$f":"DATA!D87","v":"Disc Mower Conditioner (13-19 FT)"},null,null,{"$f":"DATA!F87","v":250000},{"$f":"DATA!AA87","v":36},{"$f":"DATA!AF87","v":116.18354982421202},{"$f":"DATA!AG87","v":56},{"$f":"DATA!AH87","v":25.827532473631805},{"$f":"DATA!AI87","v":198},{"$f":"DATA!AJ87","v":50.4}]
[{"$f":"DATA!D88","v":"Disc Mower Conditioner (30 FT)"},null,null,{"$f":"DATA!F88","v":450000},{"$f":"DATA!AA88","v":64},{"$f":"DATA!AF88","v":209.13038968358157},{"$f":"DATA!AG88","v":100.79999999999998},{"$f":"DATA!AH88","v":46.489558452537231},{"$f":"DATA!AI88","v":356},{"$f":"DATA!AJ88","v":89.6}]
[{"$f":"DATA!D89","v":"Sickle Mower Conditioner (14-18 FT)"},null,null,{"$f":"DATA!F89","v":225000},{"$f":"DATA!AA89","v":32},{"$f":"DATA!AF89","v":104.56519484179078},{"$f":"DATA!AG89","v":50.399999999999991},{"$f":"DATA!AH89","v":23.244779226268616},{"$f":"DATA!AI89","v":178},{"$f":"DATA!AJ89","v":44.8}]
[]
[]
["SP Mower/Conditioners (continued)"]
["Machine Size",null,null,"Purchase Price","Litre / Hour","Labour Cost           ($/hr)","Margin on Labour & Fuel\n($/hr)","Custom Rate                     ($/hr)","Work Rate (acre/hr)","Custom Rate ($/acre)"]
[]
[]
[{"$f":"A7","v":"Disc Mower Conditioner (13-19 FT)"},null,null,{"$f":"DATA!F87","v":250000},{"$f":"DATA!AA87","v":36},{"$f":"DATA!AK87","v":27},{"$f":"DATA!AL87","v":11.610000000000001},{"$f":"DATA!AN87","v":287},{"$f":"DATA!AD87","v":12},{"$f":"DATA!AO87","v":24}]
[{"$f":"A8","v":"Disc Mower Conditioner (30 FT)"},null,null,{"$f":"DATA!F88","v":450000},{"$f":"DATA!AA88","v":64},{"$f":"DATA!AK88","v":27},{"$f":"DATA!AL88","v":17.489999999999998},{"$f":"DATA!AN88","v":490},{"$f":"DATA!AD88","v":23},{"$f":"DATA!AO88","v":21}]
[{"$f":"A9","v":"Sickle Mower Conditioner (14-18 FT)"},null,null,{"$f":"DATA!F89","v":225000},{"$f":"DATA!AA89","v":32},{"$f":"DATA!AK89","v":27},{"$f":"DATA!AL89","v":10.77},{"$f":"DATA!AN89","v":261},{"$f":"DATA!AD89","v":9},{"$f":"DATA!AO89","v":29}]
[]
[{"$f":"\"Annual hours of use: \"&DATA!Y87","v":"Annual hours of use: 150"}]
["Notes: Fuel type is diesel with a 75% load assumption. To calculate fuel consumption with alternative load, refer to Appendix E."]
["            Fuel efficiency is based on 226 hp (16' disc), 400 hp (30' disc), and 190 hp (18' sickle)."]
[]
[]
["PT Mower/Conditioners"]
["Machine Size","Purchase Price","Ownership Cost                ($/hr)","Repair & Maint.\n(R&M) Cost\n($/hr)","Margin on\nOwnership\nand R&M\n($/hr)","Rental Rate    ($/hr)","Power Unit Cost ($/hr)","Custom Rate                     ($/hr)","Work Rate (acre/hr)","Custom Rate ($/acre)"]
[]
[]
["Sickle"]
[{"$f":"DATA!E90","v":"9-10 FT "},{"$f":"DATA!F90","v":30000},{"$f":"DATA!AF90","v":13.942025978905438},{"$f":"DATA!AG90","v":4.2},{"$f":"DATA!AH90","v":2.7213038968358156},{"$f":"DATA!AI90","v":21},{"$f":"DATA!AM90","v":116},{"$f":"DATA!AN90","v":137},{"$f":"DATA!AD90","v":4},{"$f":"DATA!AO90","v":34}]
[null,null,null,null,null,null,"(50 hp)"]
[]
[{"$f":"DATA!E91","v":"14-16 FT"},{"$f":"DATA!F91","v":55000},{"$f":"DATA!AF91","v":25.56038096132664},{"$f":"DATA!AG91","v":7.7},{"$f":"DATA!AH91","v":4.9890571441989957},{"$f":"DATA!AI91","v":38},{"$f":"DATA!AM91","v":116},{"$f":"DATA!AN91","v":154},{"$f":"DATA!AD91","v":8},{"$f":"DATA!AO91","v":19}]
[null,null,null,null,null,null,"(100 hp)"]
["Disc"]
[{"$f":"DATA!E92","v":"7-9 FT side pull"},{"$f":"DATA!F92","v":40000},{"$f":"DATA!AF92","v":18.589367971873916},{"$f":"DATA!AG92","v":7.0133333333333336},{"$f":"DATA!AH92","v":3.840405195781087},{"$f":"DATA!AI92","v":29},{"$f":"DATA!AM90","v":116},{"$f":"DATA!AN92","v":145},{"$f":"DATA!AD92","v":7},{"$f":"DATA!AO92","v":21}]
[null,null,null,null,null,null,"(60 hp)"]
[]
[{"$f":"DATA!E93","v":"14 FT"},{"$f":"DATA!F93","v":55000},{"$f":"DATA!AF93","v":25.56038096132664},{"$f":"DATA!AG93","v":9.6433333333333326},{"$f":"DATA!AH93","v":5.2805571441989958},{"$f":"DATA!AI93","v":40},{"$f":"DATA!AM93","v":116},{"$f":"DATA!AN93","v":156},{"$f":"DATA!AD93","v":9},{"$f":"DATA!AO93","v":17}]
[null,null,null,null,null,null,"(90 hp)"]
[]
[{"$f":"DATA!E94","v":"16-18 FT"},{"$f":"DATA!F94","v":65000},{"$f":"DATA!AF94","v":30.207722954295114},{"$f":"DATA!AG94","v":11.396666666666667},{"$f":"DATA!AH94","v":6.2406584431442669},{"$f":"DATA!AI94","v":48},{"$f":"DATA!AM94","v":116},{"$f":"DATA!AN94","v":164},{"$f":"DATA!AD94","v":12},{"$f":"DATA!AO94","v":14}]
[null,null,null,null,null,null,"(100 hp)"]
[]
[{"$f":"\"Sickle annual hours of use: \"&DATA!Y90","v":"Sickle annual hours of use: 150"}]
[{"$f":"\"Disc annual hours of use: \"&DATA!Y92","v":"Disc annual hours of use: 150"}]
["Notes: The power units for all PT mower/conditioners are two-wheel drive tractors. Note that the smallest  two-wheel drive tractor available in this guide is 100 hp, so power unit cost for equipment that requires a smaller power unit may be over-estimated. Power unit cost includes fuel, labour, and margin for tractor. "]

{"sheet":"Harvesting Hay Balers","index":16,"n_rows":45,"n_cols":11,"rows_kept":45,"cut":false,"hidden":true,"merged":[[35,1,35,2],[24,1,24,2],[25,1,25,2],[26,1,26,2],[27,1,27,2],[28,1,28,2],[29,1,29,2],[30,1,30,2],[31,1,31,2],[32,1,32,2],[33,1,33,2],[34,1,34,2],[23,1,23,2],[12,1,12,2],[13,1,13,2],[14,1,14,2],[15,1,15,2],[16,1,16,2],[17,1,17,2],[18,1,18,2],[19,1,19,2],[20,1,20,2],[21,1,21,2],[22,1,22,2],[11,1,11,2],[3,7,5,7],[3,8,5,8],[3,9,5,9],[3,10,5,10],[6,1,6,2],[7,1,7,2],[8,1,8,2],[9,1,9,2],[10,1,10,2],[2,0,2,10],[3,0,5,0],[3,1,5,2],[3,3,5,3],[3,4,5,4],[3,5,5,5],[3,6,5,6]]}
[null,null,null,null,null,null,null,null,null,null,"Harvesting Hay"]
[]
["Balers"]
["Machine Size","Purchase Price",null,"Ownership Cost                ($/hr)","Repair & Maint.\n(R&M) Cost\n($/hr)","Margin on\nOwnership\nand R&M\n($/hr)","Rental Rate    ($/hr)","Power Unit Cost\n($/hr)","Custom Rate                     ($/hr)","Work Rate (bale/hr)","Custom Rate ($/bale)"]
[]
[]
["Large Round Balers"]
[{"$f":"DATA!E98","v":"4x5 FT bale"},{"$f":"DATA!F98","v":48000},null,{"$f":"DATA!AF98","v":33.460862349373052},{"$f":"DATA!AG98","v":7.5840000000000005},{"$f":"DATA!AH98","v":6.1567293524059581},{"$f":"DATA!AI98","v":47},{"$f":"DATA!AM98","v":116},{"$f":"DATA!AN98","v":163},{"$f":"DATA!AD98","v":15},{"$f":"DATA!AO98","v":11}]
[null,null,null,null,null,null,null,"(80 hp)"]
[]
[{"$f":"DATA!E99","v":"5x5 FT bale"},{"$f":"DATA!F99","v":55000},null,{"$f":"DATA!AF99","v":38.340571441989958},{"$f":"DATA!AG99","v":8.6900000000000013},{"$f":"DATA!AH99","v":7.0545857162984946},{"$f":"DATA!AI99","v":54},{"$f":"DATA!AM99","v":135},{"$f":"DATA!AN99","v":189},{"$f":"DATA!AD99","v":12},{"$f":"DATA!AO99","v":16}]
[null,null,null,null,null,null,null,"(135 hp)"]
[]
[{"$f":"DATA!E100","v":"5x6 FT bale"},{"$f":"DATA!F100","v":75000},null,{"$f":"DATA!AF100","v":52.282597420895399},{"$f":"DATA!AG100","v":11.850000000000001},{"$f":"DATA!AH100","v":9.6198896131343083},{"$f":"DATA!AI100","v":74},{"$f":"DATA!AM100","v":135},{"$f":"DATA!AN100","v":209},{"$f":"DATA!AD100","v":13},{"$f":"DATA!AO100","v":16}]
[null,null,null,null,null,null,null,"(135 hp)"]
[]
[{"$f":"DATA!E101","v":"5x5 FT bale"},{"$f":"DATA!F101","v":65000},null,{"$f":"DATA!AF101","v":45.311584431442668},{"$f":"DATA!AG101","v":10.27},{"$f":"DATA!AH101","v":8.3372376647163993},{"$f":"DATA!AI101","v":64},{"$f":"DATA!AM101","v":135},{"$f":"DATA!AN101","v":199},{"$f":"DATA!AD101","v":16},{"$f":"DATA!AO101","v":12}]
["(silage / net wrap)",null,null,null,null,null,null,"(135 hp)"]
[]
[{"$f":"DATA!E102","v":"5x6 FT bale"},{"$f":"DATA!F102","v":85000},null,{"$f":"DATA!AF102","v":59.253610410348109},{"$f":"DATA!AG102","v":13.430000000000001},{"$f":"DATA!AH102","v":10.902541561552216},{"$f":"DATA!AI102","v":84},{"$f":"DATA!AM102","v":135},{"$f":"DATA!AN102","v":219},{"$f":"DATA!AD102","v":17},{"$f":"DATA!AO102","v":13}]
["(silage / net wrap)",null,null,null,null,null,null,"(135 hp)"]
["Large Square Balers"]
["Small",{"$f":"DATA!F105","v":160000},null,{"$f":"DATA!AF105","v":74.357471887495663},{"$f":"DATA!AG105","v":19.093333333333334},{"$f":"DATA!AH105","v":14.017620783124348},{"$f":"DATA!AI105","v":107},{"$f":"DATA!AM105","v":135},{"$f":"DATA!AN105","v":242},{"$f":"DATA!AD105","v":40},{"$f":"DATA!AO105","v":6}]
[{"$f":"DATA!E105","v":"35x31x108\" bale"},null,null,null,null,null,null,"(145 hp)"]
[]
["Medium",{"$f":"DATA!F106","v":180000},null,{"$f":"DATA!AF106","v":83.652155873432619},{"$f":"DATA!AG106","v":21.48},{"$f":"DATA!AH106","v":15.769823381014893},{"$f":"DATA!AI106","v":121},{"$f":"DATA!AM106","v":135},{"$f":"DATA!AN106","v":256},{"$f":"DATA!AD106","v":40},{"$f":"DATA!AO106","v":6.5}]
[{"$f":"DATA!E106","v":"35x47x108\" bale"},null,null,null,null,null,null,"(145 hp)"]
[]
["Large",{"$f":"DATA!F107","v":225000},null,{"$f":"DATA!AF107","v":104.56519484179078},{"$f":"DATA!AG107","v":26.85},{"$f":"DATA!AH107","v":19.712279226268617},{"$f":"DATA!AI107","v":151},{"$f":"DATA!AM107","v":176},{"$f":"DATA!AN107","v":327},{"$f":"DATA!AD107","v":40},{"$f":"DATA!AO107","v":8.25}]
[{"$f":"DATA!E107","v":"50x47x108\" bale"},null,null,null,null,null,null,"(180 hp)"]
["Small Square Baler"]
[{"$f":"DATA!E103","v":"14x18x52\" bale"},{"$f":"DATA!F103","v":30000},null,{"$f":"DATA!AF103","v":16.434779226268617},{"$f":"DATA!AG103","v":3.15},{"$f":"DATA!AH103","v":2.9377168839402921},{"$f":"DATA!AI103","v":23},{"$f":"DATA!AM103","v":116},{"$f":"DATA!AN103","v":139},{"$f":"DATA!AD103","v":175},{"$f":"DATA!AO103","v":0.75}]
[null,null,null,null,null,null,null,"(50 hp)"]
[]
[{"$f":"DATA!E104","v":"16x18x52\" bale"},{"$f":"DATA!F104","v":45000},null,{"$f":"DATA!AF104","v":24.652168839402929},{"$f":"DATA!AG104","v":4.7250000000000005},{"$f":"DATA!AH104","v":4.4065753259104392},{"$f":"DATA!AI104","v":34},{"$f":"DATA!AM104","v":116},{"$f":"DATA!AN104","v":150},{"$f":"DATA!AD104","v":175},{"$f":"DATA!AO104","v":0.75}]
[null,null,null,null,null,null,null,"(50 hp)"]
[]
[{"$f":"\"Large Round Balers annual hours of use: \"&DATA!Y98","v":"Large Round Balers annual hours of use: 100"}]
[{"$f":"\"Large Square Balers annual hours of use: \"&DATA!Y105","v":"Large Square Balers annual hours of use: 150"}]
[{"$f":"\"Small Square Balers annual hours of use: \"&DATA!Y103","v":"Small Square Balers annual hours of use: 100"}]
["Notes: Cost of twine is not included in above rates. For the cost of twine, $0.80/bale for 5' diameter,and $1.00/bale for 6' diameter."]
["           Add $1.00/bale for large square and $0.10/bale for small square. For the cost of mesh, add $1.75 to $2.00/bale. "]
["           Power units for small round and small square balers are two-wheel drive tractors and power units for large round and large square balers"]
["           are front wheel assist tractors. Note that the smallest two-wheel drive tractor available in this guide is 100 hp, so power unit cost for"]
["            equipment that requires a smaller power unit may be over-estimated.  Power unit cost includes fuel, labour, and margin for tractor. "]

{"sheet":"Harvesting Hay PT Bale Movers","index":17,"n_rows":40,"n_cols":9,"rows_kept":40,"cut":false,"hidden":true,"merged":[[25,0,25,8],[26,0,28,0],[26,3,28,3],[26,4,28,4],[26,5,28,5],[26,8,28,8],[26,1,28,2],[26,6,28,7],[2,0,2,8],[3,0,5,0],[3,1,5,2],[3,3,5,3],[3,4,5,4],[3,5,5,5],[3,6,5,6],[3,7,5,7],[3,8,5,8],[7,1,7,2],[6,1,6,2],[19,1,19,2],[8,1,8,2],[9,1,9,2],[10,1,10,2],[11,1,11,2],[12,1,12,2],[13,1,13,2],[14,1,14,2],[15,1,15,2],[16,1,16,2],[17,1,17,2],[18,1,18,2],[33,8,35,8],[29,1,29,2],[33,1,35,2],[32,0,32,8],[36,1,36,2],[29,6,29,7],[33,6,35,7],[36,6,36,7],[33,0,35,0],[33,3,35,3],[33,4,35,4],[33,5,35,5],[6,0,7,0],[9,0,10,0],[12,0,13,0],[15,0,16,0],[18,0,19,0]]}
["Harvesting Hay"]
[]
["PT Bale Movers (Self Load/Unload)"]
["Machine Size","Purchase Price",null,"Ownership Cost                ($/hr)","Repair & Maint.\n(R&M) Cost\n($/hr)","Margin on\nOwnership\nand R&M\n($/hr)","Rental Rate    ($/hr)","Power Unit Cost ($/hr)","Custom Rate                     ($/hr)"]
[]
[]
[{"$f":"DATA!D108","v":"Round Bale 7-12 bale (requires 120 hp)"},{"$f":"DATA!F108","v":40000},null,{"$f":"DATA!AF108","v":27.884051957810872},{"$f":"DATA!AG108","v":10.52},{"$f":"DATA!AH108","v":5.7606077936716309},{"$f":"DATA!AI108","v":44},{"$f":"DATA!AM108","v":135},{"$f":"DATA!AN108","v":179}]
[null,null,null,null,null,null,null,"(120 hp)"]
[]
[{"$f":"DATA!D109","v":"Round Bale 12-18 bale (requires 180 hp)"},{"$f":"DATA!F109","v":70000},null,{"$f":"DATA!AF109","v":48.797090926169027},{"$f":"DATA!AG109","v":18.41},{"$f":"DATA!AH109","v":10.081063638925354},{"$f":"DATA!AI109","v":77},{"$f":"DATA!AM109","v":176},{"$f":"DATA!AN109","v":253}]
[null,null,null,null,null,null,null,"(180 hp)"]
[" "]
[{"$f":"DATA!D110","v":"Large Square 4-6 bale (requires 120 hp)"},{"$f":"DATA!F110","v":80000},null,{"$f":"DATA!AF110","v":21.913038968358155},{"$f":"DATA!AG110","v":8.4},{"$f":"DATA!AH110","v":4.5469558452537235},{"$f":"DATA!AI110","v":35},{"$f":"DATA!AM110","v":135},{"$f":"DATA!AN110","v":170}]
[null,null,null,null,null,null,null,"(120 hp)"]
[]
[{"$f":"DATA!D111","v":"Large Square 6-12 bale (requires 180 hp)"},{"$f":"DATA!F111","v":90000},null,{"$f":"DATA!AF111","v":24.652168839402929},{"$f":"DATA!AG111","v":9.4500000000000011},{"$f":"DATA!AH111","v":5.1153253259104394},{"$f":"DATA!AI111","v":39},{"$f":"DATA!AM111","v":176},{"$f":"DATA!AN111","v":215}]
[null,null,null,null,null,null,null,"(180 hp)"]
[]
[{"$f":"DATA!D112","v":"Large Square 12-20 bale (requires 220 hp)"},{"$f":"DATA!F112","v":115000},null,{"$f":"DATA!AF112","v":31.499993517014854},{"$f":"DATA!AG112","v":12.074999999999999},{"$f":"DATA!AH112","v":6.5362490275522278},{"$f":"DATA!AI112","v":50},{"$f":"DATA!AM112","v":176},{"$f":"DATA!AN112","v":226}]
[null,null,null,null,null,null,null,"(220 hp)"]
[{"$f":"\"Round bale mover annual hours of use: \"&DATA!Y108","v":"Round bale mover annual hours of use: 100"}]
[{"$f":"\"Square bale mover annual hours of use: \"&DATA!Y110","v":"Square bale mover annual hours of use: 200"}]
["Notes:  Power units for all PT bale movers are front wheel assist tractors. Power unit cost includes fuel, labour, and margin for tractor. "]
[]
[]
["SP Bale Mover"]
["Machine Size","Purchase Price",null,"Litre / Hour","Ownership Cost                ($/hr)","Repair & Maint.\n(R&M) Cost\n($/hr)","Margin on\nOwnership and R&M\n($/hr)",null,"Rental Rate    ($/hr)"]
[]
[]
[{"$f":"DATA!D113","v":"Self propelled Small Square Bale Wagon"},{"$f":"DATA!F113","v":345000},null,{"$f":"DATA!AA113","v":28},{"$f":"DATA!AF113","v":160.33329875741254},{"$f":"DATA!AG113","v":60.49},{"$f":"DATA!AH113","v":33.123494813611877},null,{"$f":"DATA!AI113","v":254}]
[]
[]
["SP Bale Mover (continued)"]
["Machine Size","Purchase Price",null,"Litre / Hour","Fuel Cost           ($/hr)","Labour Cost           ($/hr)","Margin on \nLabour & Fuel\n($/hr)",null,"Custom Rate                     ($/hr)"]
[]
[]
[{"$f":"A30","v":"Self propelled Small Square Bale Wagon"},{"$f":"DATA!F113","v":345000},null,{"$f":"DATA!AA113","v":28},{"$f":"DATA!AJ113","v":39.199999999999996},{"$f":"DATA!AK113","v":27},{"$f":"DATA!AL113","v":9.9299999999999979},null,{"$f":"DATA!AN113","v":330}]
[{"$f":"\"Annual hours of use: \"&DATA!Y113","v":"Annual hours of use: 150"}]
["Notes: Fuel type is diesel with a 75% load assumption. To calculate fuel consumption with alternative load, refer to Appendix E."]
["           Fuel efficiency is based on 173 hp engine."]

{"sheet":"Seeding Air Drills ","index":18,"n_rows":50,"n_cols":11,"rows_kept":50,"cut":false,"hidden":true,"merged":[[49,0,50,10],[32,0,34,0],[32,3,34,3],[32,4,34,4],[32,5,34,5],[32,6,34,6],[38,1,38,2],[39,1,39,2],[40,1,40,2],[32,8,34,8],[32,9,34,9],[46,0,48,10],[3,10,5,10],[14,1,14,2],[35,1,35,2],[36,1,36,2],[37,1,37,2],[32,10,34,10],[3,1,5,2],[7,1,7,2],[10,1,10,2],[13,1,13,2],[6,1,6,2],[8,1,8,2],[9,1,9,2],[11,1,11,2],[12,1,12,2],[2,0,2,10],[3,0,5,0],[3,3,5,3],[3,4,5,4],[43,0,45,10],[32,7,34,7],[17,0,20,10],[21,0,22,10],[23,0,28,10],[3,5,5,5],[3,6,5,6],[3,7,5,7],[3,8,5,8],[3,9,5,9],[32,1,34,2],[31,0,31,10]]}
[null,null,null,null,null,null,null,null,null,null,"Seeding"]
[]
["Air Drills with Independent Openers"]
["Machine Size","Purchase Price",null,"Ownership Cost\n($/hr)","Repair & Maint.\n(R&M) Cost\n($/hr)","Margin on\nOwnership\nand R&M\n($/hr)","Rental Rate\n($/hr)","Power Unit Cost\n($/hr)","Custom Rate\n($/hr)","Work Rate\n(acre/hr)","Custom Rate\n($/acre)"]
[]
[]
["Small"]
[{"$f":"DATA!E114","v":"25-45 FT"},{"$f":"DATA!F114","v":400000},null,{"$f":"DATA!AF114","v":139.4202597890544},{"$f":"DATA!AG114","v":73.599999999999994},{"$f":"DATA!AH114","v":31.953038968358157},{"$f":"DATA!AI114","v":245},{"$f":"DATA!AM114","v":279},{"$f":"DATA!AN114","v":524},{"$f":"DATA!AD114","v":14},{"$f":"DATA!AO114","v":37}]
[null,null,null,null,null,null,null,"(400 hp)"]
["Medium"]
[{"$f":"DATA!E115","v":"46-65 FT"},{"$f":"DATA!F115","v":750000},null,{"$f":"DATA!AF115","v":261.412987104477},{"$f":"DATA!AG115","v":138},{"$f":"DATA!AH115","v":59.911948065671545},{"$f":"DATA!AI115","v":459},{"$f":"DATA!AM115","v":319},{"$f":"DATA!AN115","v":778},{"$f":"DATA!AD115","v":23},{"$f":"DATA!AO115","v":34}]
[null,null,null,null,null,null,null,"(500 hp)"]
["Large"]
[{"$f":"DATA!E116","v":"66-86 FT"},{"$f":"DATA!F116","v":950000},null,{"$f":"DATA!AF116","v":331.1231169990042},{"$f":"DATA!AG116","v":174.8},{"$f":"DATA!AH116","v":75.888467549850631},{"$f":"DATA!AI116","v":582},{"$f":"DATA!AM116","v":351},{"$f":"DATA!AN116","v":933},{"$f":"DATA!AD116","v":30},{"$f":"DATA!AO116","v":31}]
[null,null,null,null,null,null,null,"(550+ hp)"]
[{"$f":"\"Annual hours of use: \"&DATA!Y114","v":"Annual hours of use: 200"}]
["Notes: Includes appropriately sized air tank (<400 bu for small, 400-600 bu for medium and >600 bu for large drills). "]
["The power units for all air drill with independent openers are four-wheel drive tractors.  Power unit cost includes fuel, labour, and margin for tractor. Power unit size (horsepower and hydraulic pressure requirements) will vary for each condition (soil type, implement type, etc.), so ensure that the power unit size and cost is appropriate."]
[]
[]
[]
["Small air drills have single shoot delivery with one hydraulic cart fan with no fertilizer mid row banding equipment.  Medium and large air drills have dual shoot delivery with two hydraulic cart fans with fertilizer mid row banding equipment. "]
[]
["An air drill with independent depth control openers utilizes a tool bar frame supported by wheels ahead of and behind the main frame, a towed commodity metering cart, and pneumatic seed and fertilizer delivery.  Hydraulic, independently controlled shank assemblies complete with gauge wheel packers are fixed to the toolbar frame. Seed/fertilizer placement depth is controlled through adjustment of the gauge wheels, and packing pressure is regulated with hydraulic force. Either hoe or disk openers can be mounted to the shank assemblies depending on the manufacturer of the implement. Independent depth control openers offer the advantage of improved ground-following capabilities and precision seed/fertilizer placement depth control."]
[]
[]
[]
[]
[]
[]
[]
["Air Hoe Drills"]
["Machine Size","Purchase Price",null,"Ownership Cost\n($/hr)","Repair & Maint.\n(R&M) Cost\n($/hr)","Margin on\nOwnership\nand R&M\n($/hr)","Rental Rate\n($/hr)","Power Unit Cost\n($/hr)","Custom Rate\n($/hr)","Work Rate\n(acre/hr)","Custom Rate\n($/acre)"]
[]
[]
["Small  "]
[{"$f":"DATA!E117","v":"27-50 FT"},{"$f":"DATA!F117","v":300000},null,{"$f":"DATA!AF117","v":104.5651948417908},{"$f":"DATA!AG117","v":47.25},{"$f":"DATA!AH117","v":22.772279226268619},{"$f":"DATA!AI117","v":175},{"$f":"DATA!AM117","v":279},{"$f":"DATA!AN117","v":454},{"$f":"DATA!AD117","v":16},{"$f":"DATA!AO117","v":28}]
[null,null,null,null,null,null,null,"(350 hp)"]
["Large  "]
[{"$f":"DATA!E118","v":"51-72 FT"},{"$f":"DATA!F118","v":750000},null,{"$f":"DATA!AF118","v":261.412987104477},{"$f":"DATA!AG118","v":118.125},{"$f":"DATA!AH118","v":56.93069806567155},{"$f":"DATA!AI118","v":436},{"$f":"DATA!AM118","v":351},{"$f":"DATA!AN118","v":787},{"$f":"DATA!AD118","v":24},{"$f":"DATA!AO118","v":33}]
[null,null,null,null,null,null,null,"(550+ hp)"]
[{"$f":"\"Annual hours of use: \"&DATA!Y117","v":"Annual hours of use: 200"}]
["Notes: Includes appropriately sized air tank (<400 bu for small and >600 bu for large drills). "]
["The power units for all air hoe drills are four-wheel drive tractors. Power unit cost includes fuel, labour, and margin for tractor. Power unit size (horsepower and hydraulic pressure requirements) will vary for each condition (soil type, implement type, etc.), so ensure the power unit size and cost is appropriate."]
[]
[]
["Air hoe drills are air drills that use soil engagement tools to plow an opening into the soil for seed and/or fertilizer placement. There are several different types of tools on the market that fall into the hoe drill category.  The specific type of tool used depends on the shank or tool holder used, the amount of allowable soil disturbance, and seed placement options."]
[]
[]
["Small air drills have single shoot delivery with one hydraulic cart fan with no fertilizer mid row banding equipment.  Large air drills have dual shoot delivery with two hydraulic cart fans with fertilizer mid row banding equipment. "]

{"sheet":"Seeding AirDiskDrill","index":19,"n_rows":47,"n_cols":11,"rows_kept":47,"cut":false,"hidden":true,"merged":[[21,0,22,10],[30,9,30,10],[30,7,30,8],[30,5,30,6],[37,4,39,4],[37,5,39,6],[37,7,39,8],[37,9,39,10],[43,0,43,2],[43,5,43,6],[43,7,43,8],[43,9,43,10],[40,7,40,8],[40,9,40,10],[44,1,44,2],[31,9,31,10],[18,0,20,10],[25,0,25,10],[26,9,28,10],[26,7,28,8],[26,0,28,2],[26,4,28,4],[26,5,28,6],[26,3,28,3],[40,5,40,6],[30,0,30,2],[44,9,44,10],[36,0,36,10],[37,0,39,2],[37,3,39,3],[2,0,2,10],[3,0,5,0],[3,3,5,3],[3,4,5,4],[3,5,5,5],[3,6,5,6],[3,7,5,7],[3,8,5,8],[3,9,5,9],[3,10,5,10],[3,1,5,2],[6,1,6,2],[7,1,7,2],[41,7,41,8],[41,9,41,10],[42,0,42,2],[42,5,42,6],[42,7,42,8],[42,9,42,10],[41,0,41,2],[41,5,41,6],[14,0,17,10],[8,1,8,2],[9,1,9,2],[10,1,10,2],[11,1,11,2],[31,1,31,2]]}
["Seeding"]
[]
["Air Disc Drills"]
["Machine Size","Purchase Price",null,"Ownership Cost\n($/hr)","Repair & Maint.\n(R&M) Cost\n($/hr)","Margin on\nOwnership\nand R&M\n($/hr)","Rental Rate\n($/hr)","Power Unit Cost\n($/hr)","Custom Rate\n($/hr)","Work Rate\n(acre/hr)","Custom Rate\n($/acre)"]
[]
[]
["Small"]
[{"$f":"DATA!E119","v":"30-49 FT"},{"$f":"DATA!F119","v":600000},null,{"$f":"DATA!AF119","v":209.1303896835816},{"$f":"DATA!AG119","v":94.5},{"$f":"DATA!AH119","v":45.544558452537238},{"$f":"DATA!AI119","v":349},{"$f":"DATA!AM119","v":319},{"$f":"DATA!AN119","v":668},{"$f":"DATA!AD119","v":19},{"$f":"DATA!AO119","v":35}]
[null,null,null,null,null,null,null,"(450 hp)"]
["Large"]
[{"$f":"DATA!E120","v":"50-70 FT"},{"$f":"DATA!F120","v":950000},null,{"$f":"DATA!AF120","v":331.1231169990042},{"$f":"DATA!AG120","v":149.625},{"$f":"DATA!AH120","v":72.112217549850627},{"$f":"DATA!AI120","v":553},{"$f":"DATA!AM120","v":351},{"$f":"DATA!AN120","v":904},{"$f":"DATA!AD120","v":28},{"$f":"DATA!AO120","v":32}]
[null,null,null,null,null,null,null,"(550+ hp)"]
[{"$f":"\"Annual hours of use: \"&DATA!Y120","v":"Annual hours of use: 200"}]
["Notes: Includes appropriately sized air tank (<400 bu for small and >600 bu for large drills). "]
["The power units for all air disc drills are four-wheel drive tractors. Power unit cost includes fuel, labour, and margin for tractor. Power unit size (horsepower and hydraulic pressure requirements) will vary for each condition (soil type, implement type, etc.), so ensure that the power unit size and cost is appropriate."]
[]
[]
[]
["Air Disc Drills are air drills that use a soil engagement tool to cut an opening into the soil for seed and/or fertilizer placement. The tool is typically a circular disk or coulter blade. Several variants of the disk are on the market with or without waves or notches, and/or may utilize a multiple disk arrangement or cleaner wheel options. "]
[]
[]
["Small air drills have single shoot delivery with one hydraulic cart fan with no fertilizer mid row banding equipment.  Large air drills have dual shoot delivery with two hydraulic cart fans with fertilizer mid row banding equipment. "]
[]
[]
[]
["Anhydrous Ammonia Fertilizer Applicators"]
["Machine Size",null,null,"Purchase Price","Ownership Cost\n($/hr)","Repair & Maint.\n(R&M) Cost\n($/hr)",null,"Margin on Ownership\nand R&M\n($/hr)",null,"Rental Rate\n($/hr)"]
[]
[]
[]
[{"$f":"DATA!E150","v":"30-60 FT"},null,null,{"$f":"DATA!F150","v":30000},{"$f":"DATA!AF150","v":10.456519484179079},{"$f":"DATA!AG150","v":3.15},null,{"$f":"DATA!AH150","v":2.0409779226268618},null,{"$f":"DATA!AI150","v":16}]
[]
[{"$f":"\"Annual hours of use: \"&DATA!Y150","v":"Annual hours of use: 200"}]
["Notes: Less tillage tool, nurse tank and trailer."]
[]
[]
["Liquid Fertilizer Applicators"]
["Machine Size",null,null,"Purchase Price","Ownership Cost\n($/hr)","Repair & Maint.\n(R&M) Cost\n($/hr)",null,"Margin on Ownership\nand R&M\n($/hr)",null,"Rental Rate\n($/hr)"]
[]
[]
[]
[{"$f":"DATA!E151","v":"25-40 FT, 1600-1800 gal.tank"},null,null,{"$f":"DATA!F151","v":50000},{"$f":"DATA!AF151","v":17.4275324736318},{"$f":"DATA!AG151","v":5.25},null,{"$f":"DATA!AH151","v":3.4016298710447699},null,{"$f":"DATA!AI151","v":26}]
[{"$f":"DATA!E152","v":"40-60 FT, 2400-3200 gal.tank"},null,null,{"$f":"DATA!F152","v":75000},{"$f":"DATA!AF152","v":26.1412987104477},{"$f":"DATA!AG152","v":7.875},null,{"$f":"DATA!AH152","v":5.1024448065671546},null,{"$f":"DATA!AI152","v":39}]
[{"$f":"DATA!E153","v":"60-75 FT, 4300 gal.tank"},null,null,{"$f":"DATA!F153","v":125000},{"$f":"DATA!AF153","v":43.5688311840795},{"$f":"DATA!AG153","v":13.125},null,{"$f":"DATA!AH153","v":8.5040746776119249},null,{"$f":"DATA!AI153","v":65}]
[]
[{"$f":"\"Annual hours of use: \"&DATA!Y151","v":"Annual hours of use: 200"}]
["Notes: Less tillage tool, includes cart."]

{"sheet":"Seeding Other Row Crop Planters","index":20,"n_rows":52,"n_cols":11,"rows_kept":52,"cut":false,"hidden":true,"merged":[[34,0,35,0],[19,0,20,0],[19,1,19,2],[3,4,5,4],[3,5,5,5],[16,0,17,0],[20,1,20,2],[6,1,6,2],[7,1,7,2],[8,1,8,2],[9,1,9,2],[10,1,10,2],[11,1,11,2],[17,1,17,2],[18,1,18,2],[12,1,12,2],[2,0,2,10],[3,6,5,6],[3,7,5,7],[3,8,5,8],[3,9,5,9],[3,10,5,10],[3,0,5,0],[3,3,5,3],[3,1,5,2],[13,1,13,2],[14,1,14,2],[15,1,15,2],[16,1,16,2],[26,0,26,10],[27,0,29,0],[27,1,29,2],[27,3,29,3],[27,4,29,4],[27,5,29,5],[27,6,29,6],[27,7,29,7],[27,8,29,8],[27,9,29,9],[27,10,29,10],[35,1,35,2],[44,1,44,2],[30,1,30,2],[31,1,31,2],[32,1,32,2],[33,1,33,2],[34,1,34,2],[40,0,40,10],[41,0,43,0],[41,1,43,2],[41,3,43,3],[41,4,43,4],[41,5,43,5],[41,8,43,8],[41,6,43,7],[31,0,32,0],[45,1,45,2],[46,1,46,2],[47,1,47,2],[48,1,48,2],[49,1,49,2],[47,9,47,10],[48,9,48,10],[49,9,49,10],[44,6,44,7],[41,9,43,10],[44,9,44,10],[45,9,45,10],[46,9,46,10],[45,6,45,7],[48,6,48,7],[49,6,49,7],[47,6,47,7],[46,6,46,7]]}
[null,null,null,null,null,null,null,null,null,null,"Seeding"]
[]
["Other Row Crop Planters"]
["Machine Size","Purchase Price",null,"Ownership Cost\n($/hr)","Repair & Maint.\n(R&M) Cost\n($/hr)","Margin on\nOwnership\nand R&M\n($/hr)","Rental Rate\n($/hr)","Power Unit Cost\n($/hr)","Custom Rate\n($/hr)","Work Rate\n(acre/hr)","Custom Rate\n($/acre)"]
[]
[]
[]
[{"$f":"DATA!E124","v":"12 row planter"},{"$f":"DATA!F124","v":170000},null,{"$f":"DATA!AF124","v":169.26083123104436},{"$f":"DATA!AG124","v":71.400000000000006},{"$f":"DATA!AH124","v":36.099124684656651},{"$f":"DATA!AI124","v":277},{"$f":"DATA!AM124","v":135},{"$f":"DATA!AN124","v":412},{"$f":"DATA!AD124","v":13},{"$f":"DATA!AO124","v":32}]
[null,null,null,null,null,null,null,"(150 hp)"]
[]
[{"$f":"DATA!E125","v":"16 row planter"},{"$f":"DATA!F125","v":280000},null,{"$f":"DATA!AF125","v":278.7825455570142},{"$f":"DATA!AG125","v":117.6},{"$f":"DATA!AH125","v":59.45738183355212},{"$f":"DATA!AI125","v":456},{"$f":"DATA!AM125","v":176},{"$f":"DATA!AN125","v":632},{"$f":"DATA!AD125","v":17},{"$f":"DATA!AO125","v":37}]
[null,null,null,null,null,null,null,"(180 hp)"]
[]
[{"$f":"DATA!E126","v":"24 row planter"},{"$f":"DATA!F126","v":420000},null,{"$f":"DATA!AF126","v":418.17381833552139},{"$f":"DATA!AG126","v":176.4},{"$f":"DATA!AH126","v":89.186072750328208},{"$f":"DATA!AI126","v":684},{"$f":"DATA!AM126","v":213},{"$f":"DATA!AN126","v":897},{"$f":"DATA!AD126","v":25},{"$f":"DATA!AO126","v":36}]
[null,null,null,null,null,null,null,"(230 hp)"]
[]
[{"$f":"DATA!E127","v":"12/24 split row planter"},{"$f":"DATA!F127","v":320000},null,{"$f":"DATA!AF127","v":318.60862349373048},{"$f":"DATA!AG127","v":134.4},{"$f":"DATA!AH127","v":67.951293524059579},{"$f":"DATA!AI127","v":521},{"$f":"DATA!AM127","v":176},{"$f":"DATA!AN127","v":697},{"$f":"DATA!AD127","v":19},{"$f":"DATA!AO127","v":37}]
[null,null,null,null,null,null,null,"(210 hp)"]
[]
[{"$f":"DATA!E128","v":"16/32 split row planter"},{"$f":"DATA!F128","v":390000},null,{"$f":"DATA!AF128","v":388.30425988298413},{"$f":"DATA!AG128","v":163.80000000000001},{"$f":"DATA!AH128","v":82.815638982447624},{"$f":"DATA!AI128","v":635},{"$f":"DATA!AM128","v":213},{"$f":"DATA!AN128","v":848},{"$f":"DATA!AD128","v":25},{"$f":"DATA!AO128","v":34}]
[null,null,null,null,null,null,null,"(250 hp)"]
[{"$f":"\"Annual hours of use: \"&DATA!Y124","v":"Annual hours of use: 100"}]
["Notes: The power units for all row crop planters are front wheel assist tractors. Power unit cost includes fuel, labour, and margin for tractor. "]
[{"$f":"\"Both 12/24 and 16/32 are high speed planters based on \"&DATA!AB127&\" mph travel speed.\"","v":"Both 12/24 and 16/32 are high speed planters based on 7.5 mph travel speed."}]
[]
[]
["Granular Fertilizer Applicators"]
["Machine Size","Purchase Price",null,"Ownership Cost\n($/hr)","Repair & Maint.\n(R&M) Cost\n($/hr)","Margin on\nOwnership\nand R&M\n($/hr)","Rental Rate\n($/hr)","Power Unit Cost\n($/hr)","Custom Rate\n($/hr)","Work Rate\n(acre/hr)","Custom Rate\n($/acre)"]
[]
[]
[]
[{"$f":"DATA!E154","v":"6-10 ton, spin 40 FT "},{"$f":"DATA!F154","v":45000},null,{"$f":"DATA!AF154","v":24.652168839402929},{"$f":"DATA!AG154","v":7.1100000000000012},{"$f":"DATA!AH154","v":4.7643253259104394},{"$f":"DATA!AI154","v":37},{"$f":"DATA!AM154","v":116},{"$f":"DATA!AN154","v":153},{"$f":"DATA!AD154","v":19},{"$f":"DATA!AO154","v":8}]
[null,null,null,null,null,null,null,"(100 hp)"]
[]
[{"$f":"DATA!E155","v":"10-12 ton, boom 60 FT"},{"$f":"DATA!F155","v":175000},null,{"$f":"DATA!AF155","v":95.869545486566949},{"$f":"DATA!AG155","v":62.65},{"$f":"DATA!AH155","v":23.777931822985042},{"$f":"DATA!AI155","v":182},{"$f":"DATA!AM155","v":213},{"$f":"DATA!AN155","v":395},{"$f":"DATA!AD155","v":35},{"$f":"DATA!AO155","v":11}]
[null,null,null,null,null,null,null,"(225+ hp)"]
[{"$f":"\"Annual hours of use: \"&DATA!Y154","v":"Annual hours of use: 100"}]
["Notes: Power unit cost includes fuel, labour, and margin for tractor. "]
[]
[]
["Rock Pickers"]
["Machine Size","Purchase Price",null,"Ownership Cost\n($/hr)","Repair & Maint.\n(R&M) Cost\n($/hr)","Margin on\nOwnership\nand R&M\n($/hr)","Rental Rate\n($/hr)",null,"Power Unit Cost\n($/hr)","Custom Rate\n($/hr)"]
[]
[]
[]
[{"$f":"DATA!E163","v":"1.5-2.5 CU. yard"},{"$f":"DATA!F163","v":35000},null,{"$f":"DATA!AF163","v":32.07825455570142},{"$f":"DATA!AG163","v":7.35},{"$f":"DATA!AH163","v":5.9142381833552129},{"$f":"DATA!AI163","v":45},null,{"$f":"DATA!AM163","v":116},{"$f":"DATA!AN163","v":161}]
[null,null,null,null,null,null,null,null,"(75 hp)"]
[]
[{"$f":"DATA!E164","v":"3.0-3.3 CU. yard"},{"$f":"DATA!F164","v":50000},null,{"$f":"DATA!AF164","v":45.826077936716317},{"$f":"DATA!AG164","v":10.5},{"$f":"DATA!AH164","v":8.4489116905074475},{"$f":"DATA!AI164","v":65},null,{"$f":"DATA!AM164","v":116},{"$f":"DATA!AN164","v":181}]
[null,null,null,null,null,null,null,null,"(85 hp)"]
[{"$f":"\"Annual hours of use: \"&DATA!Y163","v":"Annual hours of use: 50"}]
["Notes: Power unit cost includes fuel, labour, and margin for tractor. "]

{"sheet":"Soil Preparation Cultivators","index":21,"n_rows":33,"n_cols":11,"rows_kept":33,"cut":false,"hidden":true,"merged":[[17,1,17,2],[29,1,29,2],[18,1,18,2],[21,1,21,2],[22,1,22,2],[23,1,23,2],[24,1,24,2],[25,1,25,2],[26,1,26,2],[27,1,27,2],[28,1,28,2],[12,1,12,2],[13,1,13,2],[14,1,14,2],[15,1,15,2],[16,1,16,2],[2,0,2,10],[6,1,6,2],[9,1,9,2],[10,1,10,2],[11,1,11,2],[3,0,5,0],[3,3,5,3],[3,4,5,4],[3,5,5,5],[3,6,5,6],[3,7,5,7],[3,8,5,8],[3,9,5,9],[3,10,5,10],[3,1,5,2]]}
["Soil Preparation"]
[]
["Cultivators"]
["Machine Size","Purchase Price",null,"Ownership Cost\n($/hr)","Repair & Maint.\n(R&M) Cost\n($/hr)","Margin on\nOwnership\nand R&M\n($/hr)","Rental Rate\n($/hr)","Power Unit Cost\n($/hr)","Custom Rate\n($/hr)","Work Rate\n(acre/hr)","Custom Rate\n($/acre)"]
[]
[]
["Cultivators, "]
["field (with tine"]
["harrows)"]
["Small "]
[{"$f":"DATA!E129","v":"24-35 FT"},{"$f":"DATA!F129","v":100000},null,{"$f":"DATA!AF129","v":27.3912987104477},{"$f":"DATA!AG129","v":7.9000000000000012},{"$f":"DATA!AH129","v":5.2936948065671547},{"$f":"DATA!AI129","v":41},{"$f":"DATA!AM129","v":213},{"$f":"DATA!AN129","v":254},{"$f":"DATA!AD129","v":15},{"$f":"DATA!AO129","v":17}]
[null,null,null,null,null,null,null,"(225+ hp)"]
["Medium"]
[{"$f":"DATA!E130","v":"36-49 FT"},{"$f":"DATA!F130","v":130000},null,{"$f":"DATA!AF130","v":35.608688323582001},{"$f":"DATA!AG130","v":10.27},{"$f":"DATA!AH130","v":6.8818032485372997},{"$f":"DATA!AI130","v":53},{"$f":"DATA!AM130","v":279},{"$f":"DATA!AN130","v":332},{"$f":"DATA!AD130","v":21},{"$f":"DATA!AO130","v":16}]
[null,null,null,null,null,null,null,"(400 hp)"]
["Large "]
[{"$f":"DATA!E131","v":"50-62 FT"},{"$f":"DATA!F131","v":175000},null,{"$f":"DATA!AF131","v":47.934772743283474},{"$f":"DATA!AG131","v":13.825000000000003},{"$f":"DATA!AH131","v":9.2639659114925212},{"$f":"DATA!AI131","v":71},{"$f":"DATA!AM131","v":319},{"$f":"DATA!AN131","v":390},{"$f":"DATA!AD131","v":27},{"$f":"DATA!AO131","v":14}]
[null,null,null,null,null,null,null,"(500 hp)"]
["Cultivators, "]
["heavy-duty (with"]
[" tine harrows)"]
["Small"]
[{"$f":"DATA!E132","v":"23-40 FT"},{"$f":"DATA!F132","v":125000},null,{"$f":"DATA!AF132","v":34.239123388059625},{"$f":"DATA!AG132","v":9.8750000000000018},{"$f":"DATA!AH132","v":6.6171185082089439},{"$f":"DATA!AI132","v":51},{"$f":"DATA!AM132","v":279},{"$f":"DATA!AN132","v":330},{"$f":"DATA!AD132","v":15},{"$f":"DATA!AO132","v":22}]
[null,null,null,null,null,null,null,"(400 hp)"]
["Medium"]
[{"$f":"DATA!E133","v":"41-50 FT"},{"$f":"DATA!F133","v":150000},null,{"$f":"DATA!AF133","v":41.08694806567155},{"$f":"DATA!AG133","v":11.850000000000001},{"$f":"DATA!AH133","v":7.9405422098507321},{"$f":"DATA!AI133","v":61},{"$f":"DATA!AM133","v":319},{"$f":"DATA!AN133","v":380},{"$f":"DATA!AD133","v":22},{"$f":"DATA!AO133","v":17}]
[null,null,null,null,null,null,null,"(500 hp)"]
["Large"]
[{"$f":"DATA!E134","v":"51-62 FT"},{"$f":"DATA!F134","v":200000},null,{"$f":"DATA!AF134","v":54.782597420895399},{"$f":"DATA!AG134","v":15.800000000000002},{"$f":"DATA!AH134","v":10.587389613134309},{"$f":"DATA!AI134","v":81},{"$f":"DATA!AM134","v":351},{"$f":"DATA!AN134","v":432},{"$f":"DATA!AD134","v":27},{"$f":"DATA!AO134","v":16}]
[null,null,null,null,null,null,null,"(550+ hp)"]
[{"$f":"\"Annual hours of use: \"&DATA!Y129","v":"Annual hours of use: 200"}]
["Notes: Power units for cultivators are front wheel assist tractors except for medium and large heavy-duty cultivators, where a four wheel-drive tractor"]
["            is selected. Power unit cost includes fuel, labour, and margin for tractor.  "]

{"sheet":"Soil Preparation Harrows","index":22,"n_rows":49,"n_cols":11,"rows_kept":49,"cut":false,"hidden":true,"merged":[[14,1,14,2],[3,1,5,2],[6,1,6,2],[7,1,7,2],[8,1,8,2],[11,1,11,2],[12,1,12,2],[13,1,13,2],[9,1,9,2],[10,1,10,2],[2,0,2,10],[3,0,5,0],[3,3,5,3],[3,4,5,4],[3,5,5,5],[3,6,5,6],[3,7,5,7],[3,8,5,8],[3,9,5,9],[3,10,5,10],[28,1,28,2],[30,1,30,2],[31,1,31,2],[32,1,32,2],[33,1,33,2],[41,1,41,2],[42,1,42,2],[43,1,43,2],[44,1,44,2],[34,1,34,2],[35,1,35,2],[36,1,36,2],[39,1,39,2],[40,1,40,2],[24,0,24,10],[25,0,27,0],[25,3,27,3],[25,4,27,4],[25,5,27,5],[25,6,27,6],[25,7,27,7],[25,8,27,8],[25,9,27,9],[25,10,27,10],[25,1,27,2]]}
[null,null,null,null,null,null,null,null,null,null,"Soil Preparation"]
[]
["Harrows"]
["Machine Size","Purchase Price",null,"Ownership Cost\n($/hr)","Repair & Maint.\n(R&M) Cost\n($/hr)","Margin on\nOwnership\nand R&M\n($/hr)","Rental Rate\n($/hr)","Power Unit Cost\n($/hr)","Custom Rate\n($/hr)","Work Rate\n(acre/hr)","Custom Rate\n($/acre)"]
[]
[]
["Harrows, mid"]
[{"$f":"DATA!E135","v":"60-90 FT"},{"$f":"DATA!F135","v":100000},null,{"$f":"DATA!AF135","v":61.101437248955094},{"$f":"DATA!AG135","v":16.8},{"$f":"DATA!AH135","v":11.685215587343263},{"$f":"DATA!AI135","v":90},{"$f":"DATA!AM135","v":279},{"$f":"DATA!AN135","v":369},{"$f":"DATA!AD135","v":51},{"$f":"DATA!AO135","v":7.25}]
[null,null,null,null,null,null,null,"(400 hp)"]
["Harrows, heavy"]
[{"$f":"DATA!E136","v":"60-90 FT"},{"$f":"DATA!F136","v":125000},null,{"$f":"DATA!AF136","v":68.478246776119249},{"$f":"DATA!AG136","v":19.750000000000004},{"$f":"DATA!AH136","v":13.234237016417888},{"$f":"DATA!AI136","v":101},{"$f":"DATA!AM136","v":351},{"$f":"DATA!AN136","v":452},{"$f":"DATA!AD136","v":51},{"$f":"DATA!AO136","v":8.75}]
[null,null,null,null,null,null,null,"(550+ hp)"]
["Harrow packers"]
[{"$f":"DATA!E137","v":"25-62 FT"},{"$f":"DATA!F137","v":50000},null,{"$f":"DATA!AF137","v":11.456519484179079},{"$f":"DATA!AG137","v":1.325},{"$f":"DATA!AH137","v":1.9172279226268616},{"$f":"DATA!AI137","v":15},{"$f":"DATA!AM137","v":176},{"$f":"DATA!AN137","v":191},{"$f":"DATA!AD137","v":32},{"$f":"DATA!AO137","v":6}]
[null,null,null,null,null,null,null,"(175 hp)"]
[{"$f":"\"Mid harrows annual hours of use: \"&DATA!Y135","v":"Mid harrows annual hours of use: 75"}]
[{"$f":"\"Heavy harrows annual hours of use: \"&DATA!Y136","v":"Heavy harrows annual hours of use: 100"}]
[{"$f":"\"Packer harrows annual hours of use: \"&DATA!Y137","v":"Packer harrows annual hours of use: 200"}]
["Notes: The power units for mid and packer harrows are front wheel assist tractors. The power unit for heavy harrows is a four-wheel drive tractor. "]
["            Power unit cost includes fuel, labour, and margin for tractor."]
[]
[]
[]
[]
["Vertical Tillage Tools"]
["Machine Size","Purchase Price",null,"Ownership Cost\n($/hr)","Repair & Maint.\n(R&M) Cost\n($/hr)","Margin on\nOwnership\nand R&M\n($/hr)","Rental Rate\n($/hr)","Power Unit Cost\n($/hr)","Custom Rate\n($/hr)","Work Rate\n(acre/hr)","Custom Rate\n($/acre)"]
[]
[]
["Compact, high-"]
["speed disk"]
["Small"]
[{"$f":"DATA!E138","v":"10-30 FT"},{"$f":"DATA!F138","v":100000},null,{"$f":"DATA!AF138","v":54.782597420895399},{"$f":"DATA!AG138","v":36.799999999999997},{"$f":"DATA!AH138","v":13.73738961313431},{"$f":"DATA!AI138","v":105},{"$f":"DATA!AM138","v":279},{"$f":"DATA!AN138","v":384},{"$f":"DATA!AD138","v":16},{"$f":"DATA!AO138","v":24}]
[null,null,null,null,null,null,null,"(400 hp)"]
["Large"]
[{"$f":"DATA!E139","v":"31-50 FT"},{"$f":"DATA!F139","v":150000},null,{"$f":"DATA!AF139","v":82.173896131343099},{"$f":"DATA!AG139","v":55.2},{"$f":"DATA!AH139","v":20.606084419701464},{"$f":"DATA!AI139","v":158},{"$f":"DATA!AM139","v":351},{"$f":"DATA!AN139","v":509},{"$f":"DATA!AD139","v":31},{"$f":"DATA!AO139","v":16}]
[null,null,null,null,null,null,null,"(550+ hp)"]
["Heavy duty, "]
["compact high-"]
["speed disk"]
["Small"]
[{"$f":"DATA!E140","v":"10-25 FT"},{"$f":"DATA!F140","v":145000},null,{"$f":"DATA!AF140","v":79.434766260298332},{"$f":"DATA!AG140","v":53.36},{"$f":"DATA!AH140","v":19.91921493904475},{"$f":"DATA!AI140","v":153},{"$f":"DATA!AM140","v":319},{"$f":"DATA!AN140","v":472},{"$f":"DATA!AD140","v":14},{"$f":"DATA!AO140","v":34}]
[null,null,null,null,null,null,null,"(500 hp)"]
["Large"]
[{"$f":"DATA!E141","v":"26-40 FT"},{"$f":"DATA!F141","v":250000},null,{"$f":"DATA!AF141","v":136.9564935522385},{"$f":"DATA!AG141","v":92},{"$f":"DATA!AH141","v":34.343474032835772},{"$f":"DATA!AI141","v":263},{"$f":"DATA!AM141","v":351},{"$f":"DATA!AN141","v":614},{"$f":"DATA!AD141","v":26},{"$f":"DATA!AO141","v":24}]
[null,null,null,null,null,null,null,"(550+ hp)"]
[{"$f":"\"Compact annual hours of use: \"&DATA!Y138","v":"Compact annual hours of use: 100"}]
[{"$f":"\"Heavy duty annual hours of use: \"&DATA!Y140","v":"Heavy duty annual hours of use: 100"}]
["Notes: Power units for small compact and small heavy-duty disks are front wheel assist tractors. Power units for large compact and large heavy-duty"]
["            disks are four-wheel drive tractors.  Power unit cost includes fuel, labour, and margin for tractor. "]

{"sheet":"Soil Prep- Land Roller","index":23,"n_rows":39,"n_cols":11,"rows_kept":39,"cut":false,"hidden":true,"merged":[[9,0,10,0],[12,0,13,0],[3,5,5,5],[3,6,5,6],[7,1,7,2],[8,1,8,2],[9,1,9,2],[10,1,10,2],[11,1,11,2],[12,1,12,2],[13,1,13,2],[6,1,6,2],[2,0,2,10],[3,7,5,7],[3,8,5,8],[3,9,5,9],[3,10,5,10],[3,0,5,0],[3,1,5,2],[3,3,5,3],[3,4,5,4],[15,0,15,10],[20,0,22,2],[23,0,23,2],[20,6,22,7],[23,6,23,7],[20,3,22,3],[20,4,22,4],[20,5,22,5],[20,8,22,8],[19,0,19,10],[20,10,22,10],[20,9,22,9],[24,6,24,7],[27,6,27,7],[28,6,28,7],[25,0,25,2],[28,0,28,2],[26,0,26,2],[30,6,30,7],[31,6,31,7],[25,6,25,7],[33,6,33,7],[35,0,35,2],[32,0,33,2],[26,6,26,7],[29,6,29,7],[29,0,30,2],[31,0,31,2],[36,6,36,7],[34,0,34,2],[32,6,32,7],[35,6,35,7],[34,6,34,7]]}
["Soil Preparation"]
[]
["Land Roller"]
["Machine Size","Purchase Price",null,"Ownership Cost\n($/hr)","Repair & Maint.\n(R&M) Cost\n($/hr)","Margin on\nOwnership\nand R&M\n($/hr)","Rental Rate\n($/hr)","Power Unit Cost\n($/hr)","Custom Rate\n($/hr)","Work Rate\n(acre/hr)","Custom Rate\n($/acre)"]
[]
[]
[{"$f":"DATA!E142","v":"20 FT (Fixed)"},{"$f":"DATA!F142","v":30000},null,{"$f":"DATA!AF142","v":21.913038968358158},{"$f":"DATA!AG142","v":4.2},{"$f":"DATA!AH142","v":3.9169558452537236},{"$f":"DATA!AI142","v":30},{"$f":"DATA!AM142","v":135},{"$f":"DATA!AN142","v":165},{"$f":"DATA!AD142","v":9},{"$f":"DATA!AO142","v":18}]
[null,null,null,null,null,null,null,"(100 hp)"]
[]
[{"$f":"DATA!E143","v":"40-50 FT\n(3 section)"},{"$f":"DATA!F143","v":75000},null,{"$f":"DATA!AF143","v":54.782597420895399},{"$f":"DATA!AG143","v":10.5},{"$f":"DATA!AH143","v":9.7923896131343096},{"$f":"DATA!AI143","v":75},{"$f":"DATA!AM143","v":213},{"$f":"DATA!AN143","v":288},{"$f":"DATA!AD143","v":26},{"$f":"DATA!AO143","v":11}]
[null,null,null,null,null,null,null,"(225+ hp)"]
[]
[{"$f":"DATA!E144","v":"55-75 FT\n(5 section)"},{"$f":"DATA!F144","v":110000},null,{"$f":"DATA!AF144","v":80.347809550646588},{"$f":"DATA!AG144","v":15.4},{"$f":"DATA!AH144","v":14.362171432596989},{"$f":"DATA!AI144","v":110},{"$f":"DATA!AM144","v":279},{"$f":"DATA!AN144","v":389},{"$f":"DATA!AD144","v":38},{"$f":"DATA!AO144","v":10}]
[null,null,null,null,null,null,null,"(400 hp)"]
[{"$f":"\"Annual hours of use: \"&DATA!Y142","v":"Annual hours of use: 75"}]
["Notes:  Power unit cost includes fuel, labour, and margin for tractor. "]
[]
[]
[]
["Land Scraper"]
["Machine Size",null,null,"Purchase Price","Ownership Cost\n($/hr)","Repair & Maint.\n(R&M) Cost\n($/hr)","Margin on\nOwnership\nand R&M\n($/hr)",null,"Rental Rate\n($/hr)","Power Unit Cost\n($/hr)","Custom Rate\n($/hr)"]
[]
[]
[{"$f":"DATA!E145","v":"10.0-15.0 CU. yard"},null,null,{"$f":"DATA!F145","v":75000},{"$f":"DATA!AF145","v":93.342370164178874},{"$f":"DATA!AG145","v":24.65625},{"$f":"DATA!AH145","v":17.699793024626832},null,{"$f":"DATA!AI145","v":136},{"$f":"DATA!AM145","v":279},{"$f":"DATA!AN145","v":415}]
[null,null,null,null,null,null,null,null,null,"(400 hp)"]
[]
[{"$f":"DATA!E146","v":"15.0+ CU. yard"},null,null,{"$f":"DATA!F146","v":125000},{"$f":"DATA!AF146","v":155.57061694029815},{"$f":"DATA!AG146","v":41.09375},{"$f":"DATA!AH146","v":29.499655041044722},null,{"$f":"DATA!AI146","v":226},{"$f":"DATA!AM146","v":351},{"$f":"DATA!AN146","v":577}]
[null,null,null,null,null,null,null,null,null,"(550 hp)"]
[]
[{"$f":"DATA!E147","v":"Pull Dozer\n15.0-20.0 CU. yard"},null,null,{"$f":"DATA!F147","v":100000},{"$f":"DATA!AF147","v":124.45649355223848},{"$f":"DATA!AG147","v":32.875},{"$f":"DATA!AH147","v":23.599724032835773},null,{"$f":"DATA!AI147","v":181},{"$f":"DATA!AM147","v":279},{"$f":"DATA!AN147","v":460}]
[null,null,null,null,null,null,null,null,null,"(400 hp)"]
[]
[{"$f":"DATA!E148","v":"Pull Dozer\n 21.0+ CU. yard"},null,null,{"$f":"DATA!F148","v":150000},{"$f":"DATA!AF148","v":186.68474032835775},{"$f":"DATA!AG148","v":49.3125},{"$f":"DATA!AH148","v":35.399586049253664},null,{"$f":"DATA!AI148","v":271},{"$f":"DATA!AM148","v":351},{"$f":"DATA!AN148","v":622}]
[null,null,null,null,null,null,null,null,null,"(550 hp)"]
[]
[{"$f":"DATA!E149","v":"Rotary Ditcher"},null,null,{"$f":"DATA!F149","v":100000},{"$f":"DATA!AF149","v":124.45649355223848},{"$f":"DATA!AG149","v":32.875},{"$f":"DATA!AH149","v":23.599724032835773},null,{"$f":"DATA!AI149","v":181},{"$f":"DATA!AM149","v":279},{"$f":"DATA!AN149","v":460}]
[null,null,null,null,null,null,null,null,null,"(400 hp)"]
[{"$f":"\"Annual hours of use: \"&DATA!Y145","v":"Annual hours of use: 80"}]
["Notes:  Power unit cost includes fuel, labour, and margin for tractor. "]

{"sheet":"Sprayers High Clearance","index":24,"n_rows":48,"n_cols":11,"rows_kept":48,"cut":false,"hidden":true,"merged":[[36,0,36,7],[37,0,39,0],[37,1,39,1],[37,2,39,2],[37,3,39,3],[37,4,39,4],[37,5,39,5],[37,6,39,6],[37,7,39,7],[3,5,5,5],[3,6,5,6],[2,0,2,7],[3,7,5,7],[3,0,5,0],[3,1,5,1],[3,2,5,2],[3,3,5,3],[3,4,5,4],[17,5,19,5],[17,6,19,6],[17,7,19,7],[16,0,16,7],[17,0,19,0],[17,1,19,1],[17,2,19,2],[17,3,19,3],[17,4,19,4]]}
[null,null,null,null,null,null,null,"Sprayers"]
[]
["High Clearance Sprayer"]
["Machine Size","Purchase Price","Litre / Hour","Ownership Cost\n($/hr)","Repair & Maint.\n(R&M) Cost\n($/hr)","Margin on\nOwnership\nand R&M\n($/hr)","Rental Rate\n($/hr)","Fuel Cost\n($/hr)"]
[]
[]
[{"$f":"DATA!D165","v":"800 US gal, 90 FT boom"},{"$f":"DATA!F165","v":475000},{"$f":"DATA!AA165","v":41},{"$f":"DATA!AF165","v":331.02476821321881},{"$f":"DATA!AG165","v":99.885714285714286},{"$f":"DATA!AH165","v":64.636572374839957},{"$f":"DATA!AI165","v":496},{"$f":"DATA!AJ165","v":57.4}]
[]
[{"$f":"DATA!D166","v":"1000 US gal, 100 FT boom"},{"$f":"DATA!F166","v":575000},{"$f":"DATA!AA166","v":52},{"$f":"DATA!AF166","v":400.71419310021219},{"$f":"DATA!AG166","v":120.91428571428571},{"$f":"DATA!AH166","v":78.244271822174667},{"$f":"DATA!AI166","v":600},{"$f":"DATA!AJ166","v":72.8}]
[]
[{"$f":"DATA!D167","v":"1200 US gal, 120 FT boom"},{"$f":"DATA!F167","v":675000},{"$f":"DATA!AA167","v":61},{"$f":"DATA!AF167","v":470.40361798720562},{"$f":"DATA!AG167","v":141.94285714285715},{"$f":"DATA!AH167","v":91.85197126950942},{"$f":"DATA!AI167","v":704},{"$f":"DATA!AJ167","v":85.399999999999991}]
[]
[{"$f":"DATA!D168","v":"1600 US gal, 130 FT boom"},{"$f":"DATA!F168","v":725000},{"$f":"DATA!AA168","v":70},{"$f":"DATA!AF168","v":505.24833043070242},{"$f":"DATA!AG168","v":152.45714285714286},{"$f":"DATA!AH168","v":98.655820993176789},{"$f":"DATA!AI168","v":756},{"$f":"DATA!AJ168","v":98}]
[]
[null,null,null,null,null,null,null,null,null,null," "]
[]
["High Clearance Sprayer (continued)"]
["Machine Size","Purchase Price","Litre / Hour","Labour Cost\n($/hr)","Margin on Labour & Fuel\n($/hr)","Custom Rate\n($/hr)","Work Rate\n(acre/hr)","Custom Rate\n($/acre)"]
[]
[]
[{"$f":"A7","v":"800 US gal, 90 FT boom"},{"$f":"DATA!F165","v":475000},{"$f":"DATA!AA165","v":41},{"$f":"DATA!AK165","v":27},{"$f":"DATA!AL165","v":12.66},{"$f":"DATA!AN165","v":593},{"$f":"DATA!AD165","v":70},{"$f":"DATA!AO165","v":8.5}]
[]
[{"$f":"A9","v":"1000 US gal, 100 FT boom"},{"$f":"DATA!F166","v":575000},{"$f":"DATA!AA166","v":52},{"$f":"DATA!AK166","v":27},{"$f":"DATA!AL166","v":14.969999999999999},{"$f":"DATA!AN166","v":715},{"$f":"DATA!AD166","v":78},{"$f":"DATA!AO166","v":9.25}]
[]
[{"$f":"A11","v":"1200 US gal, 120 FT boom"},{"$f":"DATA!F167","v":675000},{"$f":"DATA!AA167","v":61},{"$f":"DATA!AK167","v":27},{"$f":"DATA!AL167","v":16.86},{"$f":"DATA!AN167","v":833},{"$f":"DATA!AD167","v":93},{"$f":"DATA!AO167","v":9}]
[]
[{"$f":"A13","v":"1600 US gal, 130 FT boom"},{"$f":"DATA!F168","v":725000},{"$f":"DATA!AA168","v":70},{"$f":"DATA!AK168","v":27},{"$f":"DATA!AL168","v":18.75},{"$f":"DATA!AN168","v":900},{"$f":"DATA!AD168","v":101},{"$f":"DATA!AO168","v":9}]
[]
[{"$f":"\"Annual hours of use: \"&DATA!Y165","v":"Annual hours of use: 175"}]
["Notes: Fuel type is diesel with a 75% load assumption. To calculate fuel consumption with alternative load, refer to Appendix E."]
[]
[{"$f":"\"The cost of hauling water is not included in the above rates.  For \"&'Sprayer Water Calc'!I5&\" gallons/acre add $\"&TEXT('Sprayer Water Calc'!I26,\"0.00\")&\"/acre, and for \"&'Sprayer Water Calc'!J5&\" gallons/acre add $\"&TEXT('Sprayer Water Calc'!J26,\"0.00\")&\"/acre. \"","v":"The cost of hauling water is not included in the above rates.  For 10 gallons/acre add $1.50/acre, and for 20 gallons/acre add $2.75/acre. "}]
[{"$f":"\"Estimated custom rates at 10 gallons/acre with water hauling included are $\"&TEXT(ROUND('Sprayer Water Calc'!I26+MIN(H21,H23,H25,H27),2),\"0.00\")&\"/acre to $\"&TEXT(ROUND('Sprayer Water Calc'!I26+MAX(H21,H23,H25,H27),2),\"0.00\")&\"/acre. \"","v":"Estimated custom rates at 10 gallons/acre with water hauling included are $10.00/acre to $10.75/acre. "}]
["These rates are not intended to be compared to commercial custom spraying rates. Refer to the introduction of this guide for more information. "]
[]
[]
["Water Hauling"]
["Machine Size","Purchase Price","Litre / Hour","Ownership Cost\n($/hr)","Repair\n& Maint.\n(R&M) Cost\n($/hr)","Fuel Cost           ($/hr)","Labour Cost\n($/hr)","Custom Rate                     ($/acre)"]
[]
[]
[{"$f":"DATA!A199&\"- \"&'Sprayer Water Calc'!H5&\" gallons/ac\"","v":"Water Truck - 5 gallons/ac"},{"$f":"DATA!F199","v":145000},{"$f":"DATA!AA199","v":27},{"$f":"DATA!AF199","v":82.496875726055251},{"$f":"DATA!AG199","v":26.1},{"$f":"DATA!AJ199","v":37.799999999999997},{"$f":"DATA!AK199","v":27},{"$f":"'Sprayer Water Calc'!H26","v":0.75}]
[]
[{"$f":"DATA!A199&\"- \"&'Sprayer Water Calc'!I5&\" gallons/ac\"","v":"Water Truck - 10 gallons/ac"},{"$f":"DATA!F199","v":145000},{"$f":"DATA!AA199","v":27},{"$f":"DATA!AF199","v":82.496875726055251},{"$f":"DATA!AG199","v":26.1},{"$f":"DATA!AJ199","v":37.799999999999997},{"$f":"DATA!AK199","v":27},{"$f":"'Sprayer Water Calc'!I26","v":1.5}]
[]
[{"$f":"DATA!A199&\"- \"&'Sprayer Water Calc'!J5&\" gallons/ac\"","v":"Water Truck - 20 gallons/ac"},{"$f":"DATA!F199","v":145000},{"$f":"DATA!AA199","v":27},{"$f":"DATA!AF199","v":82.496875726055251},{"$f":"DATA!AG199","v":26.1},{"$f":"DATA!AJ199","v":37.799999999999997},{"$f":"DATA!AK199","v":27},{"$f":"'Sprayer Water Calc'!J26","v":2.75}]
[]
[{"$f":"\"Annual hours of use: \"&DATA!Y199","v":"Annual hours of use: 175"}]
[{"$f":"\"Based on truck and equipment cost of $\"&TEXT(DATA!F199,\"#,###\")&\",  $\"&'Sprayer Water Calc'!G14&\" cost and \"&'Sprayer Water Calc'!G13&\" minutes per \"&TEXT('Sprayer Water Calc'!G9,\"#,###\")&\" gallon load of water, incl. labour and fuel costs.\"","v":"Based on truck and equipment cost of $145,000,  $20 cost and 75 minutes per 2,400 gallon load of water, incl. labour and fuel costs."}]

{"sheet":"Misc. Post Pounder, Feed Mixers","index":25,"n_rows":52,"n_cols":9,"rows_kept":52,"cut":false,"hidden":true,"merged":[[11,1,11,2],[9,1,9,2],[10,1,10,2],[6,1,6,2],[7,1,7,2],[8,1,8,2],[2,0,2,8],[3,0,5,0],[3,3,5,3],[3,9,5,9],[3,1,5,2],[3,4,5,4],[3,5,5,5],[3,6,5,6],[3,7,5,7],[3,8,5,8],[17,0,17,8],[18,0,20,0],[18,3,20,3],[18,4,20,4],[18,5,20,5],[18,6,20,6],[18,7,20,7],[18,8,20,8],[18,1,20,2],[24,1,24,2],[25,1,25,2],[26,1,26,2],[23,1,23,2],[21,1,21,2],[22,1,22,2],[31,6,33,6],[31,7,33,7],[31,8,33,8],[30,0,30,8],[31,0,33,0],[31,3,33,3],[34,1,34,2],[35,1,35,2],[36,1,36,2],[37,1,37,2],[38,1,38,2],[41,0,42,0],[44,0,45,0],[47,0,48,0],[31,4,33,4],[31,5,33,5],[31,1,33,2],[48,1,48,2],[39,1,39,2],[40,1,40,2],[41,1,41,2],[42,1,42,2],[43,1,43,2],[44,1,44,2],[45,1,45,2],[46,1,46,2],[47,1,47,2]]}
["Miscellaneous"]
[]
["Post Pounders"]
["Machine Size","Purchase Price",null,"Ownership Cost\n($/hr)","Repair & Maint.\n(R&M) Cost\n($/hr)","Margin on\nOwnership\nand R&M\n($/hr)","Rental Rate\n($/hr)","Power Unit Cost\n($/hr)","Custom Rate\n($/hr)"]
[]
[]
[{"$f":"DATA!E169","v":"3-point hitch mount"},{"$f":"DATA!F169","v":10500},null,{"$f":"DATA!AF169","v":14.380431822985043},{"$f":"DATA!AG169","v":5.5125000000000002},{"$f":"DATA!AH169","v":2.9839397734477564},{"$f":"DATA!AI169","v":23},{"$f":"DATA!AM169","v":116},{"$f":"DATA!AN169","v":139}]
[null,null,null,null,null,null,null,"(55 hp)"]
[{"$f":"DATA!D170","v":"Trailer mounted with engine"},{"$f":"DATA!F170","v":25000},null,{"$f":"DATA!AF170","v":34.239123388059625},{"$f":"DATA!AG170","v":13.125},{"$f":"DATA!AH170","v":7.1046185082089437},{"$f":"DATA!AI170","v":54},{"$f":"DATA!AM170","v":116},{"$f":"DATA!AN170","v":170}]
[null,null,null,null,null,null,null,"(55 hp)"]
[{"$f":"DATA!E171","v":"Skid steer mounted"},{"$f":"DATA!F171","v":12500},null,{"$f":"DATA!AF171","v":17.119561694029812},{"$f":"DATA!AG171","v":6.5625},{"$f":"DATA!AH171","v":3.5523092541044718},{"$f":"DATA!AI171","v":27},{"$f":"DATA!AM171","v":116},{"$f":"DATA!AN171","v":143}]
[null,null,null,null,null,null,null,"(55 hp)"]
[{"$f":"\"Annual hours of use: \"&DATA!Y169","v":"Annual hours of use: 40"}]
["Notes: The power units for all post pounders are two-wheel drive tractors. Note that the smallest two-wheel drive tractor available in this guide is "]
["            100hp so power unit cost for equipment that requires a smaller power unit may be over-estimated. "]
["            Power unit cost includes fuel, labour, and margin for tractor."]
[]
["Vertical Feed Mixer"]
["Machine Size","Purchase Price",null,"Ownership Cost\n($/hr)","Repair & Maint.\n(R&M) Cost\n($/hr)","Margin on\nOwnership\nand R&M\n($/hr)","Rental Rate\n($/hr)","Power Unit Cost\n($/hr)","Custom Rate\n($/hr)"]
[]
[]
[{"$f":"DATA!E179","v":"280-360 cubic FT"},{"$f":"DATA!F179","v":43000},null,{"$f":"DATA!AF179","v":14.987677927323348},{"$f":"DATA!AG179","v":5.6545000000000005},{"$f":"DATA!AH179","v":3.0963266890985022},{"$f":"DATA!AI179","v":24},{"$f":"DATA!AM179","v":135},{"$f":"DATA!AN179","v":159}]
[null,null,null,null,null,null,null,"(110 hp)"]
[{"$f":"DATA!E180","v":"500-750 cubic FT"},{"$f":"DATA!F180","v":70000},null,{"$f":"DATA!AF180","v":24.398545463084513},{"$f":"DATA!AG180","v":9.2050000000000001},{"$f":"DATA!AH180","v":5.0405318194626769},{"$f":"DATA!AI180","v":39},{"$f":"DATA!AM180","v":176},{"$f":"DATA!AN180","v":215}]
[null,null,null,null,null,null,null,"(160 hp)"]
[{"$f":"DATA!E181","v":"830-1,150 cubic FT"},{"$f":"DATA!F181","v":100000},null,{"$f":"DATA!AF181","v":34.8550649472636},{"$f":"DATA!AG181","v":13.15},{"$f":"DATA!AH181","v":7.2007597420895397},{"$f":"DATA!AI181","v":55},{"$f":"DATA!AM181","v":213},{"$f":"DATA!AN181","v":268}]
[null,null,null,null,null,null,null,"(225+ hp)"]
[{"$f":"\"Annual hours of use: \"&DATA!Y179","v":"Annual hours of use: 200"}]
["Notes: The power units for all vertical feed mixers are front wheel assist tractors. Power unit cost includes fuel, labour, and margin for tractor."]
[]
["Grinder Mixers, Feed Mixers, and Bale Processors"]
["Machine Size","Purchase Price",null,"Ownership Cost\n($/hr)","Repair & Maint.\n(R&M) Cost\n($/hr)","Margin on\nOwnership\nand R&M\n($/hr)","Rental Rate\n($/hr)","Power Unit Cost\n($/hr)","Custom Rate\n($/hr)"]
[]
[]
["Grinder Mixers"]
[{"$f":"DATA!E183","v":"360-440 cubic FT"},{"$f":"DATA!F183","v":70000},null,{"$f":"DATA!AF183","v":24.398545463084513},{"$f":"DATA!AG183","v":11.025},{"$f":"DATA!AH183","v":5.3135318194626775},{"$f":"DATA!AI183","v":41},{"$f":"DATA!AM183","v":135},{"$f":"DATA!AN183","v":176}]
[null,null,null,null,null,null,null,"(120 hp)"]
[]
[{"$f":"DATA!E184","v":"500-750 cubic FT"},{"$f":"DATA!F184","v":90000},null,{"$f":"DATA!AF184","v":31.369558452537234},{"$f":"DATA!AG184","v":14.175000000000001},{"$f":"DATA!AH184","v":6.8316837678805848},{"$f":"DATA!AI184","v":52},{"$f":"DATA!AM184","v":176},{"$f":"DATA!AN184","v":228}]
[null,null,null,null,null,null,null,"(200 hp)"]
["Feed Mixers"]
[{"$f":"DATA!E182","v":"Two 6 FT bale, \n40 bu grain"},{"$f":"DATA!F182","v":65000},null,{"$f":"DATA!AF182","v":22.655792215721334},{"$f":"DATA!AG182","v":10.237500000000001},{"$f":"DATA!AH182","v":4.9339938323581993},{"$f":"DATA!AI182","v":38},{"$f":"DATA!AM182","v":135},{"$f":"DATA!AN182","v":173}]
[null,null,null,null,null,null,null,"(100 hp)"]
["Bale Processors"]
[{"$f":"DATA!E185","v":"Two 6 FT round bale"},{"$f":"DATA!F185","v":40000},null,{"$f":"DATA!AF185","v":13.942025978905436},{"$f":"DATA!AG185","v":6.3},{"$f":"DATA!AH185","v":3.0363038968358151},{"$f":"DATA!AI185","v":23},{"$f":"DATA!AM185","v":135},{"$f":"DATA!AN185","v":158}]
[null,null,null,null,null,null,null,"(155 hp)"]
[]
[{"$f":"DATA!E186","v":"Six 6 FT round bale"},{"$f":"DATA!F186","v":70000},null,{"$f":"DATA!AF186","v":24.398545463084513},{"$f":"DATA!AG186","v":11.025},{"$f":"DATA!AH186","v":5.3135318194626775},{"$f":"DATA!AI186","v":41},{"$f":"DATA!AM186","v":176},{"$f":"DATA!AN186","v":217}]
[null,null,null,null,null,null,null,"(175 hp)"]
[{"$f":"\"Grinder / Feed mixer annual Hours of Use: \"&DATA!Y182","v":"Grinder / Feed mixer annual Hours of Use: 200"},null,null,{"$f":"\"Bale processor annual Hours of Use: \"&DATA!Y185","v":"Bale processor annual Hours of Use: 200"}]
["Note: The power units for all grinder mixers, feed mixers, and bale processors are front wheel assist tractors. "]
["          Power unit cost includes fuel, labour, and margin for tractor."]

{"sheet":"Misc. Grain Bagger, Conveyor ","index":26,"n_rows":47,"n_cols":11,"rows_kept":47,"cut":false,"hidden":true,"merged":[[18,0,18,2],[20,0,20,2],[24,0,24,10],[36,0,36,10],[3,0,5,1],[14,0,16,1],[17,0,17,2],[19,0,19,2],[25,3,27,4],[28,3,28,4],[30,3,30,4],[29,3,29,4],[31,3,31,4],[28,0,28,2],[30,0,30,2],[25,5,27,5],[2,0,2,10],[13,0,13,10],[14,3,16,4],[17,3,17,4],[6,0,6,2],[8,0,8,2],[7,0,7,2],[9,0,9,2],[14,9,16,9],[14,10,16,10],[14,5,16,5],[14,6,16,6],[14,7,16,7],[19,3,19,4],[20,3,20,4],[18,3,18,4],[3,10,5,10],[3,5,5,5],[3,6,5,6],[3,7,5,7],[3,8,5,8],[3,9,5,9],[14,8,16,8],[3,3,5,4],[6,3,6,4],[8,3,8,4],[7,3,7,4],[9,3,9,4],[25,10,27,10],[33,0,34,9],[37,0,39,0],[37,1,39,1],[37,2,39,2],[37,3,39,3],[37,8,39,8],[37,9,39,9],[25,6,27,6],[25,7,27,7],[25,0,27,1],[25,8,27,8],[25,9,27,9],[37,10,39,10],[43,0,45,0],[37,4,39,4],[37,5,39,5],[37,6,39,6],[37,7,39,7]]}
[null,null,null,null,null,null,null,null,null,null,"Miscellaneous"]
[]
["Grain Bag Loader"]
["Machine Size",null,null,"Purchase Price",null,"Ownership Cost\n($/hr)","Repair & Maint.\n(R&M) Cost\n($/hr)","Margin on\nOwnership\nand R&M\n($/hr)","Rental Rate\n($/hr)","Power Unit Cost\n($/hr)","Custom Rate\n($/hr)"]
[]
[]
[{"$f":"DATA!E63","v":"10 FT Bagger"},null,null,{"$f":"DATA!F63","v":40000},null,{"$f":"DATA!AF63","v":33.855064947263593},{"$f":"DATA!AG63","v":8.4},{"$f":"DATA!AH63","v":6.3382597420895381},{"$f":"DATA!AI63","v":49},{"$f":"DATA!AM63","v":116},{"$f":"DATA!AN63","v":165}]
[null,null,null,null,null,null,null,null,null,"(60 hp)"]
[{"$f":"DATA!E64","v":"12 FT Bagger"},null,null,{"$f":"DATA!F64","v":50000},null,{"$f":"DATA!AF64","v":42.318831184079492},{"$f":"DATA!AG64","v":10.5},{"$f":"DATA!AH64","v":7.9228246776119233},{"$f":"DATA!AI64","v":61},{"$f":"DATA!AM64","v":127},{"$f":"DATA!AN64","v":188}]
[null,null,null,null,null,null,null,null,null,"(125 hp)"]
[{"$f":"\"Annual Hours of Use: \"&DATA!Y63","v":"Annual Hours of Use: 100"}]
["Note: Power unit cost includes fuel, labour, and margin for tractor. Additional labour to operate bagger should be added if required."]
[]
["Grain Bag Extractor"]
["Machine Size",null,null,"Purchase Price",null,"Ownership Cost\n($/hr)","Repair & Maint.\n(R&M) Cost\n($/hr)","Margin on\nOwnership\nand R&M\n($/hr)","Rental Rate\n($/hr)","Power Unit Cost\n($/hr)","Custom Rate\n($/hr)"]
[]
[]
[{"$f":"DATA!E65","v":"10 FT Unloader"},null,null,{"$f":"DATA!F65","v":40000},null,{"$f":"DATA!AF65","v":33.855064947263593},{"$f":"DATA!AG65","v":8.4},{"$f":"DATA!AH65","v":6.3382597420895381},{"$f":"DATA!AI65","v":49},{"$f":"DATA!AM65","v":116},{"$f":"DATA!AN65","v":165}]
[null,null,null,null,null,null,null,null,null,"(60 hp)"]
[{"$f":"DATA!E66","v":"12 FT Unloader"},null,null,{"$f":"DATA!F66","v":50000},null,{"$f":"DATA!AF66","v":42.318831184079492},{"$f":"DATA!AG66","v":10.5},{"$f":"DATA!AH66","v":7.9228246776119233},{"$f":"DATA!AI66","v":61},{"$f":"DATA!AM66","v":127},{"$f":"DATA!AN66","v":188}]
[null,null,null,null,null,null,null,null,null,"(100 hp)"]
[{"$f":"\"Annual Hours of Use: \"&DATA!Y66","v":"Annual Hours of Use: 100"}]
["Note: Power unit cost includes fuel, labour, and margin for tractor. Additional labour to operate extractor should be added if required."]
[]
["Belt Grain Conveyor (PTO)"]
["Machine Size",null,null,"Purchase Price",null,"Ownership Cost\n($/hr)","Repair & Maint.\n(R&M) Cost\n($/hr)","Margin on\nOwnership\nand R&M\n($/hr)","Rental Rate\n($/hr)","Power Unit Cost\n($/hr)","Custom Rate\n($/hr)"]
[]
[]
[{"$f":"DATA!E61","v":"20-24 in. (90 FT, non swing)"},null,null,{"$f":"DATA!F61","v":45000},null,{"$f":"DATA!AF61","v":44.804337678805858},{"$f":"DATA!AG61","v":9.9449999999999985},{"$f":"DATA!AH61","v":8.2124006518208787},{"$f":"DATA!AI61","v":63},{"$f":"DATA!AM61","v":116},{"$f":"DATA!AN61","v":179}]
[null,null,null,null,null,null,null,null,null,"(100 hp)"]
[{"$f":"DATA!E62","v":"20-24 in. (100+ FT, swing away)"},null,null,{"$f":"DATA!F62","v":100000},null,{"$f":"DATA!AF62","v":99.565194841790799},{"$f":"DATA!AG62","v":22.1},{"$f":"DATA!AH62","v":18.249779226268618},{"$f":"DATA!AI62","v":140},{"$f":"DATA!AM62","v":135},{"$f":"DATA!AN62","v":275}]
[null,null,null,null,null,null,null,null,null,"(130 hp)"]
[{"$f":"\"Annual Hours of Use: \"&DATA!Y61","v":"Annual Hours of Use: 100"}]
[{"$f":"\"Power unit cost includes fuel, labour, and margin. To obtain a total cost for auger, power unit, and fuel (but not labour), subtract $\"&TEXT(Labour+(Labour*Margin_percentage),\"#.00\")&\" from the Custom Rate ($\"&Labour&\"/hr labour plus \"&Margin_percentage*100&\"% margin).\"","v":"Power unit cost includes fuel, labour, and margin. To obtain a total cost for auger, power unit, and fuel (but not labour), subtract $31.05 from the Custom Rate ($27/hr labour plus 15% margin)."}]
[]
[]
["Grain Trucks"]
["Machine Size","Purchase Price","Litre / Hour","Ownership Cost\n($/hr)","Repair\n& Maint.\n(R&M)\nCost\n($/hr)","Margin on Ownership and R&M\n($/hr)","Rental Rate    ($/hr)","Fuel Cost           ($/hr)","Labour Cost\n($/hr)","Margin on Labour & Fuel\n($/hr)","Custom Rate                     ($/hr)"]
[]
[]
[]
[{"$f":"DATA!D187","v":"Tandem"},{"$f":"DATA!F187","v":200000},{"$f":"DATA!AA187","v":27},{"$f":"DATA!AF187","v":92.946839859369589},{"$f":"DATA!AG187","v":35.06666666666667},{"$f":"DATA!AH187","v":19.202025978905436},{"$f":"DATA!AI187","v":147},{"$f":"DATA!AJ187","v":37.799999999999997},{"$f":"DATA!AK187","v":27},{"$f":"DATA!AL187","v":9.7199999999999989},{"$f":"DATA!AN187","v":222}]
[]
[{"$f":"DATA!D188","v":"Truck and 40FT Straight Trailer"},{"$f":"DATA!F188","v":275000},{"$f":"DATA!AA188","v":32},{"$f":"DATA!AF188","v":127.80190480663317},{"$f":"DATA!AG188","v":48.216666666666669},{"$f":"DATA!AH188","v":26.402785720994977},{"$f":"DATA!AI188","v":202},{"$f":"DATA!AJ188","v":44.8},{"$f":"DATA!AK188","v":27},{"$f":"DATA!AL188","v":10.77},{"$f":"DATA!AN188","v":285}]
[]
[]
[{"$f":"\"Annual hours of use: \"&DATA!Y187","v":"Annual hours of use: 150"}]

{"sheet":"Misc. Spreader Loader","index":27,"n_rows":60,"n_cols":9,"rows_kept":60,"cut":false,"hidden":true,"merged":[[59,0,60,8],[59,31,59,33],[56,0,57,0],[56,1,56,2],[57,1,57,2],[54,0,55,0],[54,1,54,2],[50,0,50,8],[51,0,53,0],[51,1,53,2],[51,3,53,3],[51,4,53,4],[51,5,53,5],[51,6,53,6],[51,7,53,7],[51,8,53,8],[27,0,29,0],[24,0,26,0],[2,0,2,8],[3,0,5,0],[3,3,5,3],[3,4,5,4],[3,5,5,5],[3,6,5,6],[3,7,5,7],[3,8,5,8],[3,1,5,2],[6,1,6,2],[7,1,7,2],[8,1,8,2],[9,1,9,2],[10,1,10,2],[17,1,17,2],[11,1,11,2],[12,1,12,2],[13,1,13,2],[14,1,14,2],[15,1,15,2],[16,1,16,2],[29,1,29,2],[23,1,23,2],[24,1,24,2],[25,1,25,2],[26,1,26,2],[27,1,27,2],[18,1,18,2],[19,1,19,2],[20,1,20,2],[21,1,21,2],[22,1,22,2],[37,1,37,2],[38,1,38,2],[33,0,33,8],[34,0,36,0],[34,1,36,2],[34,3,36,3],[34,4,36,4],[34,5,36,5],[34,6,36,6],[34,7,36,7],[34,8,36,8],[43,6,45,7],[46,6,46,7],[47,6,47,7],[42,0,42,8],[43,0,45,0],[43,1,45,2],[43,3,45,3],[43,8,45,8],[43,4,45,5],[46,4,46,5],[47,4,47,5],[46,1,46,2],[47,1,47,2]]}
["Miscellaneous"]
[]
["Manure Spreader (Solid)"]
["Machine Size","Purchase Price",null,"Ownership Cost\n($/hr)","Repair & Maint.\n(R&M) Cost\n($/hr)","Margin on\nOwnership\nand R&M\n($/hr)","Rental Rate\n($/hr)","Power Unit Cost\n($/hr)","Custom Rate\n($/hr)"]
[]
[]
[{"$f":"DATA!E189","v":"250-299 cubic FT"},{"$f":"DATA!F189","v":35000},null,{"$f":"DATA!AF189","v":34.847818194626775},{"$f":"DATA!AG189","v":16.170000000000002},{"$f":"DATA!AH189","v":7.6526727291940162},{"$f":"DATA!AI189","v":59},{"$f":"DATA!AM189","v":135},{"$f":"DATA!AN189","v":194}]
["chain unload",null,null,null,null,null,null,"(120 hp)"]
[]
[{"$f":"DATA!E190","v":"300-399 cubic FT"},{"$f":"DATA!F190","v":38000},null,{"$f":"DATA!AF190","v":37.8347740398805},{"$f":"DATA!AG190","v":17.555999999999997},{"$f":"DATA!AH190","v":8.3086161059820736},{"$f":"DATA!AI190","v":64},{"$f":"DATA!AM190","v":135},{"$f":"DATA!AN190","v":199}]
["chain unload",null,null,null,null,null,null,"(125 hp)"]
[]
[{"$f":"DATA!E191","v":"400-500 cubic FT"},{"$f":"DATA!F191","v":56000},null,{"$f":"DATA!AF191","v":55.756509111402856},{"$f":"DATA!AG191","v":25.872},{"$f":"DATA!AH191","v":12.244276366710427},{"$f":"DATA!AI191","v":94},{"$f":"DATA!AM191","v":135},{"$f":"DATA!AN191","v":229}]
["chain unload",null,null,null,null,null,null,"(150 hp)"]
[]
[{"$f":"DATA!E192","v":"300-399 cubic FT"},{"$f":"DATA!F192","v":65000},null,{"$f":"DATA!AF192","v":64.717376647164002},{"$f":"DATA!AG192","v":30.03},{"$f":"DATA!AH192","v":14.2121064970746},{"$f":"DATA!AI192","v":109},{"$f":"DATA!AM192","v":135},{"$f":"DATA!AN192","v":244}]
["side discharge",null,null,null,null,null,null,"(150 hp)"]
[]
[{"$f":"DATA!E193","v":"400-500 cubic FT"},{"$f":"DATA!F193","v":85000},null,{"$f":"DATA!AF193","v":84.630415615522182},{"$f":"DATA!AG193","v":39.270000000000003},{"$f":"DATA!AH193","v":18.585062342328325},{"$f":"DATA!AI193","v":142},{"$f":"DATA!AM193","v":176},{"$f":"DATA!AN193","v":318}]
["side discharge",null,null,null,null,null,null,"(180 hp)"]
[]
[{"$f":"DATA!E194","v":"500+ cubic FT"},{"$f":"DATA!F194","v":95000},null,{"$f":"DATA!AF194","v":94.586935099701265},{"$f":"DATA!AG194","v":43.89},{"$f":"DATA!AH194","v":20.771540264955192},{"$f":"DATA!AI194","v":159},{"$f":"DATA!AM194","v":176},{"$f":"DATA!AN194","v":335}]
["side discharge",null,null,null,null,null,null,"(200 hp)"]
[]
[{"$f":"DATA!D195","v":"250-300 cubic FT, hyd. push, vert. beaters (requires 150 hp)"},{"$f":"DATA!F195","v":75000},null,{"$f":"DATA!AF195","v":74.673896131343099},{"$f":"DATA!AG195","v":34.65},{"$f":"DATA!AH195","v":16.398584419701464},{"$f":"DATA!AI195","v":126},{"$f":"DATA!AM195","v":135},{"$f":"DATA!AN195","v":261}]
[null,null,null,null,null,null,null,"(150 hp)"]
[]
[{"$f":"DATA!D196","v":"400-500 cubic FT, hyd. push, vert. beaters (requires 200 hp)"},{"$f":"DATA!F196","v":95000},null,{"$f":"DATA!AF196","v":94.586935099701265},{"$f":"DATA!AG196","v":43.89},{"$f":"DATA!AH196","v":20.771540264955192},{"$f":"DATA!AI196","v":159},{"$f":"DATA!AM196","v":176},{"$f":"DATA!AN196","v":335}]
[null,null,null,null,null,null,null,"(200hp)"]
[]
[{"$f":"\"Annual hours of use: \"&DATA!Y196","v":"Annual hours of use: 100"}]
["Notes: Power units for all manure spreaders are front wheel assist tractors. Power unit cost includes fuel, labour, and margin for tractor. "]
[]
["Front End Loader"]
["Machine Size","Purchase Price",null,"Ownership Cost\n($/hr)","Repair & Maint.\n(R&M) Cost\n($/hr)","Margin on\nOwnership\nand R&M\n($/hr)","Rental Rate\n($/hr)","Power Unit Cost\n($/hr)","Custom Rate\n($/hr)"]
[]
[]
[{"$f":"DATA!D172","v":"For 100-159 hp tractor"},{"$f":"DATA!F172","v":23000},null,{"$f":"DATA!AF172","v":12.59999740680594},{"$f":"DATA!AG172","v":7.9809999999999999},{"$f":"DATA!AH172","v":3.0871496110208914},{"$f":"DATA!AI172","v":24},{"$f":"DATA!AM172","v":135},{"$f":"DATA!AN172","v":159}]
[{"$f":"DATA!D173","v":"For 160-224 hp tractor"},{"$f":"DATA!F173","v":25000},null,{"$f":"DATA!AF173","v":13.69564935522385},{"$f":"DATA!AG173","v":8.6750000000000007},{"$f":"DATA!AH173","v":3.3555974032835776},{"$f":"DATA!AI173","v":26},{"$f":"DATA!AM173","v":176},{"$f":"DATA!AN173","v":202}]
[{"$f":"\"Annual hours of use: \"&DATA!Y172","v":"Annual hours of use: 100"}]
["Notes:  The power unit cost includes fuel, labour, and margin for front wheel assist tractors."]
[]
["Livestock Trailer"]
["Machine Size","Purchase Price",null,"Ownership Cost\n($/hr)","Repair & Maint.\n(R&M) Cost\n($/hr)",null,"Margin on\nOwnership\nand R&M\n($/hr)",null,"Rental Rate\n($/hr)"]
[]
[]
[{"$f":"DATA!D177","v":"20 FT gooseneck"},{"$f":"DATA!F177","v":26000},null,{"$f":"DATA!AF177","v":18.124633772577074},{"$f":"DATA!AG177","v":5.46},null,{"$f":"DATA!AH177","v":3.5376950658865609},null,{"$f":"DATA!AI177","v":27}]
[{"$f":"DATA!D178","v":"24 FT gooseneck"},{"$f":"DATA!F178","v":38000},null,{"$f":"DATA!AF178","v":26.489849359920335},{"$f":"DATA!AG178","v":7.98},null,{"$f":"DATA!AH178","v":5.1704774039880492},null,{"$f":"DATA!AI178","v":40}]
[{"$f":"\"Annual hours of use: \"&DATA!Y177","v":"Annual hours of use: 100"}]
[]
["Snow Blower"]
["Machine Size","Purchase Price",null,"Ownership Cost\n($/hr)","Repair & Maint.\n(R&M) Cost\n($/hr)","Margin on\nOwnership\nand R&M\n($/hr)","Rental Rate\n($/hr)","Power Unit Cost\n($/hr)","Custom Rate\n($/hr)"]
[]
[]
[{"$f":"DATA!D175","v":"Rear mount, 96 in. (requires 110 hp)"},{"$f":"DATA!F175","v":11000},null,{"$f":"DATA!AF175","v":12.052171432596989},{"$f":"DATA!AG175","v":2.3100000000000005},{"$f":"DATA!AH175","v":2.1543257148895485},{"$f":"DATA!AI175","v":17},{"$f":"DATA!AM175","v":135},{"$f":"DATA!AN175","v":152}]
[]
[{"$f":"DATA!D176","v":"Rear mount, 108 in. (requires 130 hp)"},{"$f":"DATA!F176","v":17000},null,{"$f":"DATA!AF176","v":18.626083123104433},{"$f":"DATA!AG176","v":3.57},{"$f":"DATA!AH176","v":3.329412468465665},{"$f":"DATA!AI176","v":26},{"$f":"DATA!AM176","v":135},{"$f":"DATA!AN176","v":161}]
[]
[{"$f":"\"Annual Hours of Use: \"&DATA!Y174","v":"Annual Hours of Use: 50"}]
["Notes:  The power units for snow blowers are front wheel assist tractors. Note that the smallest front wheel assist tractor available in this guide is 100 hp, so power unit cost for equipment that requires a smaller power unit may be over-estimated."]

{"sheet":"Appendix A","index":28,"n_rows":56,"n_cols":10,"rows_kept":56,"cut":false,"hidden":true,"merged":[[55,0,56,9],[10,1,12,1],[27,0,27,1],[33,0,33,1],[38,0,38,1]]}
[null,null,null,null,null,null,null,null,null,"Appendix A"]
[]
["Hauling Grain from Field to Yard"]
[]
[null,"Truck cost - excluding labour",null,null,null,{"$f":"DATA!AI187-DATA!AH187+DATA!AJ187","v":165.59797402109456},"/hour*"]
[null,"Auger cost - 8 inch x 55' with gas engine (excluding labour)",null,null,null,{"$f":"'Harvesting Grain Power Auger'!I9","v":20},"/hour"]
[null,"Labour cost",null,null,null,{"$f":"Labour","v":27},"/hour"]
[]
["Distance from Field to Yard (miles)",null,0.5,1,1.5,2,3,4,6,10]
["TIME USE"]
["(A)","Time unload twice from one combine or once from each of two combines (min)",10,10,10,10,10,10,10,10]
[]
[]
["(B)","Travel time to yard and return (min)",4,6.5,8.5,10,12,15,21,33]
["(C)","Time truck running during unload (min)",4,4,4,4,4,4,4,4]
["(D)","Truck running time per trip (min)",{"$f":"SUM(C11:C15)","v":18},20.5,22.5,24,26,29,35,47]
["(E)","Total unload time at bin (min)",7,7,7,7,7,7,7,7]
[]
["Wait Time in Field"]
["(truck not running) (min)"]
["(F)","Hauling from one combine (min)",47,44.5,42.5,41,39,36,30,18]
["(G)","Hauling from two combines (min)",11,8.5,6.5,5,3,0,0,0]
[]
["Total Time per Trip"]
["(H)","Hauling from one combine (min) ",{"$f":"C14+C11+C17+C21","v":68},68,68,68,68,68,68,68]
["(I)","Hauling from two combines (min) ",{"$f":"C14+C17+C11+C22","v":32},32,32,32,32,32,38,50]
[]
["COMPONENT COSTS PER TRIP"]
["(J)","Truck costs per trip ",{"$f":"C16/60*$F$5","v":49.679392206328366},56.579307790540639,62.099240257910459,66.239189608437826,71.759122075807639,80.039020776862372,96.598818178971825,129.71841298319075]
["(K)","Auger costs per trip",{"$f":"C17/60*$F$6","v":2.3333333333333335},2.3333333333333335,2.3333333333333335,2.3333333333333335,2.3333333333333335,2.3333333333333335,2.3333333333333335,2.3333333333333335]
["(L)","Labour costs per trip (one combine)",{"$f":"C25/60*$F$7","v":30.599999999999998},30.599999999999998,30.599999999999998,30.599999999999998,30.599999999999998,30.599999999999998,30.599999999999998,30.599999999999998]
["(M)","Labour costs per trip (two combines)",14.4,14.4,14.4,14.4,14.4,14.4,17.099999999999998,22.5]
[]
["CUSTOM RATE ($/hr)"]
[{"$f":"\"(includes \"&Margin_percentage*100&\"% margin)\"","v":"(includes 15% margin)"}]
["(N)","Hauling from one combine",{"$f":"SUM(C29:C31)*60/C25*(1+Margin_percentage)","v":83.827618562303769},90.829003493342711,96.430111438173824,100.63094239679718,106.23205034162831,114.63371225887502,131.43703609336845,165.04368376235533]
["(O)","Hauling from two combines",{"$f":"(C29+C30+C32)*60/C26*(1+Margin_percentage)","v":143.20243944489556},158.08038242335323,169.98273680611945,178.90950259319405,190.81185697596021,208.66538855010947,210.68995932497515,213.2814099168032]
[]
["CUSTOM RATE ($/bu)"]
[{"$f":"\"(includes \"&Margin_percentage*100&\"% margin)\"","v":"(includes 15% margin)"}]
["(P)","Hauling from one combine",{"$f":"C36/300","v":0.27942539520767923},{"$f":"D36/300","v":0.30276334497780905},0.32143370479391276,0.33543647465599058,0.35410683447209435,0.38211237419625005,0.43812345364456151,0.55014561254118444]
[null,"(bu/hr = 300)"]
["(Q)","Hauling from two combines",{"$f":"C37/600","v":0.23867073240815928},{"$f":"D37/600","v":0.26346730403892205},0.28330456134353244,0.29818250432199006,0.31801976162660034,0.34777564758351576,0.35114993220829194,0.35546901652800533]
[null,"(bu/hr = 600)"]
[]
["Calculations used to determine costs:"]
["D = A + B + C                               ",null,null,null,"# trips/hr one combine = (60 min/hr)/H"]
["H = A + B + E + F",null,null,null,"# trips/hr two combines = (60 min/hr)/I"]
["I = A + B + E + G",null,null,null,{"$f":"\"N = (J + K + L)*(60 min/hr)/H*\"&1+Margin_percentage","v":"N = (J + K + L)*(60 min/hr)/H*1.15"}]
[null,null,null,null,{"$f":"\"O = (J + K + M)*(60 min/hr)/I*\"&1+Margin_percentage","v":"O = (J + K + M)*(60 min/hr)/I*1.15"}]
["J = D/(60 min/hr)*(truck cost) "]
["K =E/(60 min/hr)*(auger cost)",null,null,null,"P = N/(300 bu/hr)"]
["L = H/(60 min/hr)*(labour cost)",null,null,null,"Q = O/(600 bu/hr)"]
["M = I/(60 min/hr)*(labour cost)"]
[]
[{"$f":"\"*Truck cost based on $\"&TEXT(DATA!F187,\"#,###\")&\" purchase price, \"&DATA!Y187&\" hours of annual usage, \"&DATA!Z187&\"% repair and maintenance rate, $\"&TEXT(Calculator!D16,\"0.00\")&\"/L diesel, \"&DATA!AA187&\" L/hr fuel usage, and \"&DATA!X187&\" year optimal life.\"","v":"*Truck cost based on $200,000 purchase price, 150 hours of annual usage, 2.63% repair and maintenance rate, $1.40/L diesel, 27 L/hr fuel usage, and 15 year optimal life."}]

{"sheet":"Appendix B","index":29,"n_rows":38,"n_cols":4,"rows_kept":38,"cut":false,"hidden":true,"merged":[[2,0,2,7],[19,1,20,1],[28,1,29,1],[35,0,35,6],[37,0,38,6]]}
["Appendix B"]
[]
["Rental Rates for Farm Buildings and Bins"]
[]
["To determine the fair rental rate for farm buildings, consider:"]
[]
[null,"Your Value",null,"Example"]
["Replacement cost of building",null,null,20000]
["Retained value of building (at end of years of service)",null,null,8000]
["Interest rate (opportunity cost not included)",null,null,5.5E-2]
["Repair rate (% of replacement cost)*",null,null,5.0000000000000001E-3]
["Annual insurance premium",null,null,60]
["Optimal life",null,null,30]
[]
["Calculate:"]
["A. Depreciation:"]
["(Replacement cost - Retained Value) / Optimal Life = ",null,null,"($20,000 - $8,000) / 30 = $400"]
[]
["B. Interest Cost:"]
["(Replacement cost) x (1.98 (Interest Rate) - 0.0054) / Years of Loan = ",null,null,"($20,000 x ((1.98 x 0.055) - "]
["This assumes 50% borrowed and seven-year loan",null,null,"0.0054)) / 7 = $296"]
[]
["C. Insurance:"]
["Annual insurance premiums =",null,null,60]
[]
["D. Repairs:"]
["Annual repair rate x Replacement cost = ",null,null,"(0.005 x $20,000) = $100"]
[]
["Total = A + B + C + D",null,null,"($400 + $296 + $60 + $100) = "]
[null,null,null,"$856 per year"]
[]
[]
["Total (per bushel)",null,null,"$856 per year / 3000 bu = "]
[null,null,null,"$0.29/year per bu"]
[]
["Repair rates are difficult to estimate. Steel buildings (bins and quonsets) might be 0.5% of replacement cost per year. Aeration fans might be higher. Wood buildings might be 1% to 3% of the replacement cost."]
[]
["For bins with aeration or natural air drying, include the purchase cost of the fan and air distribution system in the replacement cost value. Add approximately $0.10 / hp / hr for electricity costs. "]

{"sheet":"Appendix C","index":30,"n_rows":30,"n_cols":7,"rows_kept":30,"cut":false,"hidden":true,"merged":[[2,0,2,7],[28,1,29,1],[4,0,4,6],[8,0,8,6]]}
[null,null,null,null,null,null,"Appendix C"]
[]
["Work Rate Calculation Worksheet"]
[]
["The work rate (acres/hr) is the sum of the implement working width (ft), the average ground speed (mph), the field efficiency and the acres per foot per mile. Formula below:"]
[]
[]
[]
["The field efficiency accounts for time spent turning, filling, and emptying equipment. Average field efficiency for operations is 80%.\nAverage field efficiency for spraying is 64% and seeding is 70%. The field efficiency must be presented as a decimal (e.g., 80% = 0.80)"]
[]
[null,"Your Value",null,"Example"]
["Impement Width (feet)",null,null,35]
["Average ground speed (mph)",null,null,5]
["Field Efficiency (%)",null,null,0.8]
["Feet / mile",null,null,5280]
["Feet2 / acre",null,null,43560]
[]
["Calculate:"]
[]
["A. Implement Width (feet):",null,null,35]
[]
["B. Average ground speed (mph):",null,null,5]
[]
["C. Field Efficiency (%):",null,null,0.8]
[]
["D. Acres per foot per mile:"]
["(Feet per mile) / (Square feet per acre)",null,null,"(5,280  / 43,560) = 0.1212"]
[]
["Total = A x B x C x D",null,null,"(35 x 5 x 0.80 x 0.1212) = "]
["Workrate (acres/hour)",null,null,"16.97 acres per hour"]

{"sheet":"Appendix D (pg1)","index":31,"n_rows":46,"n_cols":5,"rows_kept":46,"cut":false,"hidden":true,"merged":[[2,0,2,3],[5,4,6,4],[5,0,6,0],[5,1,6,1],[5,2,6,2],[5,3,6,3]]}
["Appendix D"]
[]
["Assumptions for Machinery Cost Calculations"]
[]
[null,"Column A","Column B","Column C","Column D"]
["Machine","Annual Hours of Usage","Optimal Life (years)","Repair Rate\n(% of purchase price)","Average Field Speed (mph)"]
[]
["Tractors"]
["     Two-wheel drive",{"$f":"DATA!Y6","v":300},{"$f":"DATA!X6","v":20},{"$f":"DATA!Z6","v":2.31}]
["     Front wheel assist",{"$f":"DATA!Y8","v":450},{"$f":"DATA!X9","v":15},{"$f":"DATA!Z8","v":2.73}]
["     Four-wheel drive",{"$f":"DATA!Y11","v":450},{"$f":"DATA!X11","v":15},{"$f":"DATA!Z11","v":2.63}]
["     Tracked",{"$f":"DATA!Y14","v":450},{"$f":"DATA!X14","v":15},{"$f":"DATA!Z14","v":3.36}]
["Combines"]
["     SP Rotary",{"$f":"DATA!Y19","v":250},{"$f":"DATA!X19","v":12},{"$f":"DATA!Z19","v":2.63}]
["Combine headers"]
["     Rigid headers",{"$f":"DATA!Y25","v":250},{"$f":"DATA!X25","v":20},{"$f":"DATA!Z27","v":2.1}]
["     Pickup headers",{"$f":"DATA!Y25","v":250},{"$f":"DATA!X25","v":20},{"$f":"DATA!Z25","v":1.58}]
["     Flex headers ",{"$f":"DATA!Y29","v":250},{"$f":"DATA!X29","v":15},{"$f":"DATA!Z29","v":2.63}]
["     Draper headers ",{"$f":"DATA!Y33","v":250},{"$f":"DATA!X33","v":15},{"$f":"DATA!Z33","v":2.94}]
["     Corn headers",{"$f":"DATA!Y37","v":100},{"$f":"DATA!X37","v":15},{"$f":"DATA!Z37","v":2.94}]
["Swathers SP",{"$f":"DATA!Y41","v":200},{"$f":"DATA!X41","v":15},{"$f":"DATA!Z41","v":2.1},{"$f":"DATA!AB41","v":5.5}]
["Grain Carts",{"$f":"DATA!Y45","v":250},{"$f":"DATA!X45","v":20},{"$f":"DATA!Z45","v":2.1}]
["Powered Augers",{"$f":"DATA!Y48","v":100},{"$f":"DATA!X48","v":20},{"$f":"DATA!Z48","v":1.58}]
["PTO Augers",{"$f":"DATA!Y54","v":100},{"$f":"DATA!X54","v":20},{"$f":"DATA!Z54","v":1.05}]
["Belt Grain Conveyor",{"$f":"DATA!Y61","v":100},{"$f":"DATA!X61","v":10},{"$f":"DATA!Z61","v":2.21}]
["Grain Vac",{"$f":"DATA!Y72","v":50},{"$f":"DATA!X72","v":15},{"$f":"DATA!Z72","v":2.1}]
["Grain Baggers",{"$f":"DATA!Y63","v":100},{"$f":"DATA!X63","v":12},{"$f":"DATA!Z63","v":2.1}]
["Grain Trucks",{"$f":"DATA!Y187","v":150},{"$f":"DATA!X187","v":15},{"$f":"DATA!Z187","v":2.63}]
["SP Forage Harvester",{"$f":"DATA!Y74","v":400},{"$f":"DATA!X74","v":10},{"$f":"DATA!Z74","v":8.4},{"$f":"DATA!AB77","v":6.5}]
["SP Forage Harvester Header",{"$f":"DATA!Y77","v":400},{"$f":"DATA!X77","v":10},{"$f":"DATA!Z77","v":8.4}]
["SP Mower/conditioner",{"$f":"DATA!Y87","v":150},{"$f":"DATA!X87","v":15},{"$f":"DATA!Z87","v":3.36},{"$f":"DATA!AB87","v":8}]
["PT Mower/conditioner (sickle)",{"$f":"DATA!Y90","v":150},{"$f":"DATA!X90","v":15},{"$f":"DATA!Z90","v":2.1},{"$f":"DATA!AB90","v":5}]
["PT Mower/conditioner (disc)",{"$f":"DATA!Y92","v":150},{"$f":"DATA!X92","v":15},{"$f":"DATA!Z92","v":2.63},{"$f":"DATA!AB92","v":8}]
["Balers"]
["     Round",{"$f":"DATA!Y98","v":100},{"$f":"DATA!X98","v":15},{"$f":"DATA!Z98","v":1.58}]
["     Large square",{"$f":"DATA!Y105","v":150},{"$f":"DATA!X105","v":15},{"$f":"DATA!Z106","v":1.79}]
["     Small square",{"$f":"DATA!Y108","v":100},{"$f":"DATA!X103","v":20},{"$f":"DATA!Z103","v":1.05}]
["Bale movers"]
["     PT Round",{"$f":"DATA!Y108","v":100},{"$f":"DATA!X108","v":15},{"$f":"DATA!Z108","v":2.63}]
["     PT Large square",{"$f":"DATA!Y110","v":200},{"$f":"DATA!X110","v":20},{"$f":"DATA!Z110","v":2.1}]
["     SP Small square",{"$f":"DATA!Y113","v":150},{"$f":"DATA!X113","v":15},{"$f":"DATA!Z113","v":2.63}]
["Air drills (independent openers)",{"$f":"DATA!Y114","v":200},{"$f":"DATA!X114","v":15},{"$f":"DATA!Z114","v":3.68},{"$f":"DATA!AB114","v":4.75}]
["Air hoe drills",{"$f":"DATA!Y117","v":200},{"$f":"DATA!X117","v":15},{"$f":"DATA!Z117","v":3.15},{"$f":"DATA!AB117","v":4.75}]
["Air disk drills",{"$f":"DATA!Y119","v":200},{"$f":"DATA!X118","v":15},{"$f":"DATA!Z119","v":3.15},{"$f":"DATA!AB119","v":5.5}]
["Row crop planters",{"$f":"DATA!Y124","v":100},{"$f":"DATA!X124","v":10},{"$f":"DATA!Z124","v":4.2},{"$f":"DATA!AB124","v":5}]
["Row crop planters - split row",{"$f":"DATA!Y127","v":100},{"$f":"DATA!X127","v":10},{"$f":"DATA!Z127","v":4.2},{"$f":"DATA!AB127","v":7.5}]

{"sheet":"Appendix D (pg2)","index":32,"n_rows":23,"n_cols":5,"rows_kept":23,"cut":false,"hidden":true,"merged":[[5,4,6,4],[2,0,2,3],[5,0,6,0],[5,1,6,1],[5,2,6,2],[5,3,6,3]]}
[null,null,null,null,"Appendix D"]
[]
[]
[]
[null,"Column A","Column B","Column C","Column D"]
["Machine","Annual Hours of Usage","Optimal Life (years)","Repair Rate\n(% of purchase price)","Average Field Speed (mph)"]
[]
["Cultivators",{"$f":"DATA!Y129","v":200},{"$f":"DATA!X129","v":20},{"$f":"DATA!Z129","v":1.58},{"$f":"DATA!AB129","v":5}]
["Standard harrows",{"$f":"DATA!Y135","v":75},{"$f":"DATA!X135","v":25},{"$f":"DATA!Z135","v":1.26},{"$f":"DATA!AB135","v":7.5}]
["Heavy harrows",{"$f":"DATA!Y136","v":100},{"$f":"DATA!X136","v":20},{"$f":"DATA!Z136","v":1.58},{"$f":"DATA!AB136","v":7.5}]
["Harrow packers",{"$f":"DATA!Y137","v":200},{"$f":"DATA!X137","v":25},{"$f":"DATA!Z137","v":0.53},{"$f":"DATA!AB137","v":7.5}]
["Vertical tillage tools",{"$f":"DATA!Y138","v":100},{"$f":"DATA!X138","v":20},{"$f":"DATA!Z138","v":3.68},{"$f":"DATA!AB138","v":8}]
["Land roller",{"$f":"DATA!Y142","v":75},{"$f":"DATA!X142","v":20},{"$f":"DATA!Z142","v":1.05},{"$f":"DATA!AB142","v":6}]
["Rock picker",{"$f":"DATA!Y163","v":50},{"$f":"DATA!X163","v":25},{"$f":"DATA!Z163","v":1.05}]
["Land scrapers and ditchers",{"$f":"DATA!Y145","v":80},{"$f":"DATA!X145","v":10},{"$f":"DATA!Z145","v":2.63}]
["High clearance sprayers",{"$f":"DATA!Y165","v":175},{"$f":"DATA!X165","v":8},{"$f":"DATA!Z165","v":3.68},{"$f":"DATA!AB165","v":10}]
["Granular spin spreaders",{"$f":"DATA!Y154","v":100},{"$f":"DATA!X154","v":20},{"$f":"DATA!Z154","v":1.58},{"$f":"DATA!AB154","v":5}]
["Granular boom spreaders",{"$f":"DATA!Y155","v":100},{"$f":"DATA!X155","v":20},{"$f":"DATA!Z155","v":3.58},{"$f":"DATA!AB155","v":6}]
["Post pounder",{"$f":"DATA!Y169","v":40},{"$f":"DATA!X169","v":20},{"$f":"DATA!Z169","v":2.1}]
["Vertical feed mixer",{"$f":"DATA!Y179","v":200},{"$f":"DATA!X179","v":15},{"$f":"DATA!Z179","v":2.63}]
["Grinder mixers and feed mixers",{"$f":"DATA!Y182","v":200},{"$f":"DATA!X182","v":15},{"$f":"DATA!Z182","v":3.15}]
["Bale processors",{"$f":"DATA!Y185","v":200},{"$f":"DATA!X185","v":15},{"$f":"DATA!Z185","v":3.15}]
["Manure spreader",{"$f":"DATA!Y189","v":100},{"$f":"DATA!X189","v":10},{"$f":"DATA!Z189","v":4.62}]

{"sheet":"Appendix E","index":33,"n_rows":3,"n_cols":1,"rows_kept":3,"cut":false,"hidden":true,"merged":[[4,0,4,13]]}
["Appendix E"]
[]
["Fuel Consumption Based on Engine Size"]

{"sheet":"Appendix F(p1)","index":34,"n_rows":40,"n_cols":14,"rows_kept":40,"cut":false,"hidden":true,"merged":[[3,0,3,13],[5,0,6,0],[4,0,4,13],[5,1,5,13]]}
[null,null,null,null,null,null,null,null,null,null,null,null,null,"Appendix F"]
[]
["Conversion Tables"]
[]
["Dollars per Hectare or Acre"]
["Hectares or acres per hour","Dollars Per Hour"]
[null,20,30,40,50,60,70,80,90,100,110,120,130,140]
[2,{"$f":"$B$7/A8","v":10},{"$f":"$C$7/A8","v":15},{"$f":"$D$7/A8","v":20},{"$f":"$E$7/A8","v":25},{"$f":"$F$7/A8","v":30},{"$f":"$G$7/A8","v":35},{"$f":"$H$7/A8","v":40},{"$f":"$I$7/A8","v":45},{"$f":"$J$7/A8","v":50},{"$f":"$K$7/A8","v":55},{"$f":"$L$7/A8","v":60},{"$f":"$M$7/A8","v":65},{"$f":"$N$7/A8","v":70}]
[{"$f":"A8+0.5","v":2.5},{"$f":"$B$7/A9","v":8},{"$f":"$C$7/A9","v":12},{"$f":"$D$7/A9","v":16},{"$f":"$E$7/A9","v":20},{"$f":"$F$7/A9","v":24},{"$f":"$G$7/A9","v":28},{"$f":"$H$7/A9","v":32},{"$f":"$I$7/A9","v":36},{"$f":"$J$7/A9","v":40},{"$f":"$K$7/A9","v":44},{"$f":"$L$7/A9","v":48},{"$f":"$M$7/A9","v":52},{"$f":"$N$7/A9","v":56}]
[{"$f":"A9+0.5","v":3},6.666666666666667,10,13.333333333333334,16.666666666666668,20,23.333333333333332,26.666666666666668,30,33.333333333333336,36.666666666666664,40,43.333333333333336,46.666666666666664]
[3.5,5.7142857142857144,8.5714285714285712,11.428571428571429,14.285714285714286,17.142857142857142,20,22.857142857142858,25.714285714285715,28.571428571428573,31.428571428571427,34.285714285714285,37.142857142857146,40]
[4,5,7.5,10,12.5,15,17.5,20,22.5,25,27.5,30,32.5,35]
[4.5,4.4444444444444446,6.666666666666667,8.8888888888888893,11.111111111111111,13.333333333333334,15.555555555555555,17.777777777777779,20,22.222222222222221,24.444444444444443,26.666666666666668,28.888888888888889,31.111111111111111]
[5,4,6,8,10,12,14,16,18,20,22,24,26,28]
[5.5,3.6363636363636362,5.4545454545454541,7.2727272727272725,9.0909090909090917,10.909090909090908,12.727272727272727,14.545454545454545,16.363636363636363,18.181818181818183,20,21.818181818181817,23.636363636363637,25.454545454545453]
[6,3.3333333333333335,5,6.666666666666667,8.3333333333333339,10,11.666666666666666,13.333333333333334,15,16.666666666666668,18.333333333333332,20,21.666666666666668,23.333333333333332]
[6.5,3.0769230769230771,4.615384615384615,6.1538461538461542,7.6923076923076925,9.2307692307692299,10.76923076923077,12.307692307692308,13.846153846153847,15.384615384615385,16.923076923076923,18.46153846153846,20,21.53846153846154]
[7,2.8571428571428572,4.2857142857142856,5.7142857142857144,7.1428571428571432,8.5714285714285712,10,11.428571428571429,12.857142857142858,14.285714285714286,15.714285714285714,17.142857142857142,18.571428571428573,20]
[7.5,2.6666666666666665,4,5.333333333333333,6.666666666666667,8,9.3333333333333339,10.666666666666666,12,13.333333333333334,14.666666666666666,16,17.333333333333332,18.666666666666668]
[8,2.5,3.75,5,6.25,7.5,8.75,10,11.25,12.5,13.75,15,16.25,17.5]
[8.5,2.3529411764705883,3.5294117647058822,4.7058823529411766,5.882352941176471,7.0588235294117645,8.235294117647058,9.4117647058823533,10.588235294117647,11.764705882352942,12.941176470588236,14.117647058823529,15.294117647058824,16.470588235294116]
[9,2.2222222222222223,3.3333333333333335,4.4444444444444446,5.5555555555555554,6.666666666666667,7.7777777777777777,8.8888888888888893,10,11.111111111111111,12.222222222222221,13.333333333333334,14.444444444444445,15.555555555555555]
[9.5,2.1052631578947367,3.1578947368421053,4.2105263157894735,5.2631578947368425,6.3157894736842106,7.3684210526315788,8.4210526315789469,9.473684210526315,10.526315789473685,11.578947368421053,12.631578947368421,13.684210526315789,14.736842105263158]
[10,2,3,4,5,6,7,8,9,10,11,12,13,14]
[10.5,1.9047619047619047,2.8571428571428572,3.8095238095238093,4.7619047619047619,5.7142857142857144,6.666666666666667,7.6190476190476186,8.5714285714285712,9.5238095238095237,10.476190476190476,11.428571428571429,12.380952380952381,13.333333333333334]
[11,1.8181818181818181,2.7272727272727271,3.6363636363636362,4.5454545454545459,5.4545454545454541,6.3636363636363633,7.2727272727272725,8.1818181818181817,9.0909090909090917,10,10.909090909090908,11.818181818181818,12.727272727272727]
[11.5,1.7391304347826086,2.6086956521739131,3.4782608695652173,4.3478260869565215,5.2173913043478262,6.0869565217391308,6.9565217391304346,7.8260869565217392,8.695652173913043,9.5652173913043477,10.434782608695652,11.304347826086957,12.173913043478262]
[12,1.6666666666666667,2.5,3.3333333333333335,4.166666666666667,5,5.833333333333333,6.666666666666667,7.5,8.3333333333333339,9.1666666666666661,10,10.833333333333334,11.666666666666666]
[{"$f":"A28+0.5","v":12.5},1.6,2.4,3.2,4,4.8,5.6,6.4,7.2,8,8.8000000000000007,9.6,10.4,11.2]
[13,1.5384615384615385,2.3076923076923075,3.0769230769230771,3.8461538461538463,4.615384615384615,5.384615384615385,6.1538461538461542,6.9230769230769234,7.6923076923076925,8.4615384615384617,9.2307692307692299,10,10.76923076923077]
[13.5,1.4814814814814814,2.2222222222222223,2.9629629629629628,3.7037037037037037,4.4444444444444446,5.1851851851851851,5.9259259259259256,6.666666666666667,7.4074074074074074,8.1481481481481488,8.8888888888888893,9.6296296296296298,10.37037037037037]
[14,1.4285714285714286,2.1428571428571428,2.8571428571428572,3.5714285714285716,4.2857142857142856,5,5.7142857142857144,6.4285714285714288,7.1428571428571432,7.8571428571428568,8.5714285714285712,9.2857142857142865,10]
[14.5,1.3793103448275863,2.0689655172413794,2.7586206896551726,3.4482758620689653,4.1379310344827589,4.8275862068965516,5.5172413793103452,6.2068965517241379,6.8965517241379306,7.5862068965517242,8.2758620689655178,8.9655172413793096,9.6551724137931032]
[15,1.3333333333333333,2,2.6666666666666665,3.3333333333333335,4,4.666666666666667,5.333333333333333,6,6.666666666666667,7.333333333333333,8,8.6666666666666661,9.3333333333333339]
[15.5,1.2903225806451613,1.935483870967742,2.5806451612903225,3.225806451612903,3.870967741935484,4.5161290322580649,5.161290322580645,5.806451612903226,6.4516129032258061,7.096774193548387,7.741935483870968,8.387096774193548,9.0322580645161299]
[16,1.25,1.875,2.5,3.125,3.75,4.375,5,5.625,6.25,6.875,7.5,8.125,8.75]
[16.5,1.2121212121212122,1.8181818181818181,2.4242424242424243,3.0303030303030303,3.6363636363636362,4.2424242424242422,4.8484848484848486,5.4545454545454541,6.0606060606060606,6.666666666666667,7.2727272727272725,7.8787878787878789,8.4848484848484844]
[{"$f":"A37+0.5","v":17},1.1764705882352942,1.7647058823529411,2.3529411764705883,2.9411764705882355,3.5294117647058822,4.117647058823529,4.7058823529411766,5.2941176470588234,5.882352941176471,6.4705882352941178,7.0588235294117645,7.6470588235294121,8.235294117647058]
[17.5,1.1428571428571428,1.7142857142857142,2.2857142857142856,2.8571428571428572,3.4285714285714284,4,4.5714285714285712,5.1428571428571432,5.7142857142857144,6.2857142857142856,6.8571428571428568,7.4285714285714288,8]
[18,1.1111111111111112,1.6666666666666667,2.2222222222222223,2.7777777777777777,3.3333333333333335,3.8888888888888888,4.4444444444444446,5,5.5555555555555554,6.1111111111111107,6.666666666666667,7.2222222222222223,7.7777777777777777]

{"sheet":"Appendix F(p2)","index":35,"n_rows":38,"n_cols":14,"rows_kept":38,"cut":false,"hidden":true,"merged":[[2,0,2,13],[3,0,4,0],[3,1,3,13]]}
["Appendix F"]
[]
["Dollars per Hectare or Acre"]
["Hectares or acres per hour","Dollars Per Hour"]
[null,150,160,170,180,190,200,210,220,230,240,250,260,270]
[4,{"$f":"$B$5/A6","v":37.5},{"$f":"$C$5/A6","v":40},{"$f":"$D$5/A6","v":42.5},{"$f":"$E$5/A6","v":45},{"$f":"$F$5/A6","v":47.5},{"$f":"$G$5/A6","v":50},{"$f":"$H$5/A6","v":52.5},{"$f":"$I$5/A6","v":55},{"$f":"$J$5/A6","v":57.5},{"$f":"$K$5/A6","v":60},{"$f":"$L$5/A6","v":62.5},{"$f":"$M$5/A6","v":65},{"$f":"$N$5/A6","v":67.5}]
[{"$f":"A6+0.5","v":4.5},{"$f":"$B$5/A7","v":33.333333333333336},{"$f":"$C$5/A7","v":35.555555555555557},{"$f":"$D$5/A7","v":37.777777777777779},{"$f":"$E$5/A7","v":40},{"$f":"$F$5/A7","v":42.222222222222221},{"$f":"$G$5/A7","v":44.444444444444443},{"$f":"$H$5/A7","v":46.666666666666664},{"$f":"$I$5/A7","v":48.888888888888886},{"$f":"$J$5/A7","v":51.111111111111114},{"$f":"$K$5/A7","v":53.333333333333336},{"$f":"$L$5/A7","v":55.555555555555557},{"$f":"$M$5/A7","v":57.777777777777779},{"$f":"$N$5/A7","v":60}]
[{"$f":"A7+0.5","v":5},30,32,34,36,38,40,42,44,46,48,50,52,54]
[5.5,27.272727272727273,29.09090909090909,30.90909090909091,32.727272727272727,34.545454545454547,36.363636363636367,38.18181818181818,40,41.81818181818182,43.636363636363633,45.454545454545453,47.272727272727273,49.090909090909093]
[6,25,26.666666666666668,28.333333333333332,30,31.666666666666668,33.333333333333336,35,36.666666666666664,38.333333333333336,40,41.666666666666664,43.333333333333336,45]
[6.5,23.076923076923077,24.615384615384617,26.153846153846153,27.692307692307693,29.23076923076923,30.76923076923077,32.307692307692307,33.846153846153847,35.384615384615387,36.92307692307692,38.46153846153846,40,41.53846153846154]
[7,21.428571428571427,22.857142857142858,24.285714285714285,25.714285714285715,27.142857142857142,28.571428571428573,30,31.428571428571427,32.857142857142854,34.285714285714285,35.714285714285715,37.142857142857146,38.571428571428569]
[7.5,20,21.333333333333332,22.666666666666668,24,25.333333333333332,26.666666666666668,28,29.333333333333332,30.666666666666668,32,33.333333333333336,34.666666666666664,36]
[8,18.75,20,21.25,22.5,23.75,25,26.25,27.5,28.75,30,31.25,32.5,33.75]
[8.5,17.647058823529413,18.823529411764707,20,21.176470588235293,22.352941176470587,23.529411764705884,24.705882352941178,25.882352941176471,27.058823529411764,28.235294117647058,29.411764705882351,30.588235294117649,31.764705882352942]
[9,16.666666666666668,17.777777777777779,18.888888888888889,20,21.111111111111111,22.222222222222221,23.333333333333332,24.444444444444443,25.555555555555557,26.666666666666668,27.777777777777779,28.888888888888889,30]
[9.5,15.789473684210526,16.842105263157894,17.894736842105264,18.94736842105263,20,21.05263157894737,22.105263157894736,23.157894736842106,24.210526315789473,25.263157894736842,26.315789473684209,27.368421052631579,28.421052631578949]
[10,15,16,17,18,19,20,21,22,23,24,25,26,27]
[10.5,14.285714285714286,15.238095238095237,16.19047619047619,17.142857142857142,18.095238095238095,19.047619047619047,20,20.952380952380953,21.904761904761905,22.857142857142858,23.80952380952381,24.761904761904763,25.714285714285715]
[11,13.636363636363637,14.545454545454545,15.454545454545455,16.363636363636363,17.272727272727273,18.181818181818183,19.09090909090909,20,20.90909090909091,21.818181818181817,22.727272727272727,23.636363636363637,24.545454545454547]
[11.5,13.043478260869565,13.913043478260869,14.782608695652174,15.652173913043478,16.521739130434781,17.391304347826086,18.260869565217391,19.130434782608695,20,20.869565217391305,21.739130434782609,22.608695652173914,23.478260869565219]
[{"$f":"A21+0.5","v":12},12.5,13.333333333333334,14.166666666666666,15,15.833333333333334,16.666666666666668,17.5,18.333333333333332,19.166666666666668,20,20.833333333333332,21.666666666666668,22.5]
[12.5,12,12.8,13.6,14.4,15.2,16,16.8,17.600000000000001,18.399999999999999,19.2,20,20.8,21.6]
[13,11.538461538461538,12.307692307692308,13.076923076923077,13.846153846153847,14.615384615384615,15.384615384615385,16.153846153846153,16.923076923076923,17.692307692307693,18.46153846153846,19.23076923076923,20,20.76923076923077]
[13.5,11.111111111111111,11.851851851851851,12.592592592592593,13.333333333333334,14.074074074074074,14.814814814814815,15.555555555555555,16.296296296296298,17.037037037037038,17.777777777777779,18.518518518518519,19.25925925925926,20]
[14,10.714285714285714,11.428571428571429,12.142857142857142,12.857142857142858,13.571428571428571,14.285714285714286,15,15.714285714285714,16.428571428571427,17.142857142857142,17.857142857142858,18.571428571428573,19.285714285714285]
[14.5,10.344827586206897,11.03448275862069,11.724137931034482,12.413793103448276,13.103448275862069,13.793103448275861,14.482758620689655,15.172413793103448,15.862068965517242,16.551724137931036,17.241379310344829,17.931034482758619,18.620689655172413]
[15,10,10.666666666666666,11.333333333333334,12,12.666666666666666,13.333333333333334,14,14.666666666666666,15.333333333333334,16,16.666666666666668,17.333333333333332,18]
[15.5,9.67741935483871,10.32258064516129,10.96774193548387,11.612903225806452,12.258064516129032,12.903225806451612,13.548387096774194,14.193548387096774,14.838709677419354,15.483870967741936,16.129032258064516,16.774193548387096,17.419354838709676]
[16,9.375,10,10.625,11.25,11.875,12.5,13.125,13.75,14.375,15,15.625,16.25,16.875]
[16.5,9.0909090909090917,9.6969696969696972,10.303030303030303,10.909090909090908,11.515151515151516,12.121212121212121,12.727272727272727,13.333333333333334,13.939393939393939,14.545454545454545,15.151515151515152,15.757575757575758,16.363636363636363]
[17,8.8235294117647065,9.4117647058823533,10,10.588235294117647,11.176470588235293,11.764705882352942,12.352941176470589,12.941176470588236,13.529411764705882,14.117647058823529,14.705882352941176,15.294117647058824,15.882352941176471]
[17.5,8.5714285714285712,9.1428571428571423,9.7142857142857135,10.285714285714286,10.857142857142858,11.428571428571429,12,12.571428571428571,13.142857142857142,13.714285714285714,14.285714285714286,14.857142857142858,15.428571428571429]
[18,8.3333333333333339,8.8888888888888893,9.4444444444444446,10,10.555555555555555,11.111111111111111,11.666666666666666,12.222222222222221,12.777777777777779,13.333333333333334,13.888888888888889,14.444444444444445,15]
[18.5,8.1081081081081088,8.6486486486486491,9.1891891891891895,9.7297297297297298,10.27027027027027,10.810810810810811,11.351351351351351,11.891891891891891,12.432432432432432,12.972972972972974,13.513513513513514,14.054054054054054,14.594594594594595]
[{"$f":"A35+0.5","v":19},7.8947368421052628,8.4210526315789469,8.9473684210526319,9.473684210526315,10,10.526315789473685,11.052631578947368,11.578947368421053,12.105263157894736,12.631578947368421,13.157894736842104,13.684210526315789,14.210526315789474]
[19.5,7.6923076923076925,8.2051282051282044,8.7179487179487172,9.2307692307692299,9.7435897435897427,10.256410256410257,10.76923076923077,11.282051282051283,11.794871794871796,12.307692307692308,12.820512820512821,13.333333333333334,13.846153846153847]
[20,7.5,8,8.5,9,9.5,10,10.5,11,11.5,12,12.5,13,13.5]

{"sheet":"Appendix F(p3)","index":36,"n_rows":33,"n_cols":14,"rows_kept":33,"cut":false,"hidden":true,"merged":[[2,0,2,13],[3,0,4,0],[3,1,3,13]]}
[null,null,null,null,null,null,null,null,null,null,null,null,null,"Appendix F"]
[]
["Dollars per Bale"]
["Bales per hour","Dollars Per Hour"]
[null,40,50,60,70,80,90,100,110,120,130,140,150,160]
[10,{"$f":"$B$5/A6","v":4},{"$f":"$C$5/A6","v":5},{"$f":"$D$5/A6","v":6},{"$f":"$E$5/A6","v":7},{"$f":"$F$5/A6","v":8},{"$f":"$G$5/A6","v":9},{"$f":"$H$5/A6","v":10},{"$f":"$I$5/A6","v":11},{"$f":"$J$5/A6","v":12},{"$f":"$K$5/A6","v":13},{"$f":"$L$5/A6","v":14},{"$f":"$M$5/A6","v":15},{"$f":"$N$5/A6","v":16}]
[12,{"$f":"$B$5/A7","v":3.3333333333333335},{"$f":"$C$5/A7","v":4.166666666666667},{"$f":"$D$5/A7","v":5},{"$f":"$E$5/A7","v":5.833333333333333},{"$f":"$F$5/A7","v":6.666666666666667},{"$f":"$G$5/A7","v":7.5},{"$f":"$H$5/A7","v":8.3333333333333339},{"$f":"$I$5/A7","v":9.1666666666666661},{"$f":"$J$5/A7","v":10},{"$f":"$K$5/A7","v":10.833333333333334},{"$f":"$L$5/A7","v":11.666666666666666},{"$f":"$M$5/A7","v":12.5},{"$f":"$N$5/A7","v":13.333333333333334}]
[14,2.8571428571428572,3.5714285714285716,4.2857142857142856,5,5.7142857142857144,6.4285714285714288,7.1428571428571432,7.8571428571428568,8.5714285714285712,9.2857142857142865,10,10.714285714285714,11.428571428571429]
[16,2.5,3.125,3.75,4.375,5,5.625,6.25,6.875,7.5,8.125,8.75,9.375,10]
[18,2.2222222222222223,2.7777777777777777,3.3333333333333335,3.8888888888888888,4.4444444444444446,5,5.5555555555555554,6.1111111111111107,6.666666666666667,7.2222222222222223,7.7777777777777777,8.3333333333333339,8.8888888888888893]
[20,2,2.5,3,3.5,4,4.5,5,5.5,6,6.5,7,7.5,8]
[22,1.8181818181818181,2.2727272727272729,2.7272727272727271,3.1818181818181817,3.6363636363636362,4.0909090909090908,4.5454545454545459,5,5.4545454545454541,5.9090909090909092,6.3636363636363633,6.8181818181818183,7.2727272727272725]
[24,1.6666666666666667,2.0833333333333335,2.5,2.9166666666666665,3.3333333333333335,3.75,4.166666666666667,4.583333333333333,5,5.416666666666667,5.833333333333333,6.25,6.666666666666667]
[26,1.5384615384615385,1.9230769230769231,2.3076923076923075,2.6923076923076925,3.0769230769230771,3.4615384615384617,3.8461538461538463,4.2307692307692308,4.615384615384615,5,5.384615384615385,5.7692307692307692,6.1538461538461542]
[28,1.4285714285714286,1.7857142857142858,2.1428571428571428,2.5,2.8571428571428572,3.2142857142857144,3.5714285714285716,3.9285714285714284,4.2857142857142856,4.6428571428571432,5,5.3571428571428568,5.7142857142857144]
[30,1.3333333333333333,1.6666666666666667,2,2.3333333333333335,2.6666666666666665,3,3.3333333333333335,3.6666666666666665,4,4.333333333333333,4.666666666666667,5,5.333333333333333]
[]
[100,0.4,0.5,0.6,0.7,0.8,0.9,1,1.1000000000000001,1.2,1.3,1.4,1.5,1.6]
[110,0.36363636363636365,0.45454545454545453,0.54545454545454541,0.63636363636363635,0.72727272727272729,0.81818181818181823,0.90909090909090906,1,1.0909090909090908,1.1818181818181819,1.2727272727272727,1.3636363636363635,1.4545454545454546]
[120,0.33333333333333331,0.41666666666666669,0.5,0.58333333333333337,0.66666666666666663,0.75,0.83333333333333337,0.91666666666666663,1,1.0833333333333333,1.1666666666666667,1.25,1.3333333333333333]
[130,0.30769230769230771,0.38461538461538464,0.46153846153846156,0.53846153846153844,0.61538461538461542,0.69230769230769229,0.76923076923076927,0.84615384615384615,0.92307692307692313,1,1.0769230769230769,1.1538461538461537,1.2307692307692308]
[140,0.2857142857142857,0.35714285714285715,0.42857142857142855,0.5,0.5714285714285714,0.6428571428571429,0.7142857142857143,0.7857142857142857,0.8571428571428571,0.9285714285714286,1,1.0714285714285714,1.1428571428571428]
[150,0.26666666666666666,0.33333333333333331,0.4,0.46666666666666667,0.53333333333333333,0.6,0.66666666666666663,0.73333333333333328,0.8,0.8666666666666667,0.93333333333333335,1,1.0666666666666667]
[160,0.25,0.3125,0.375,0.4375,0.5,0.5625,0.625,0.6875,0.75,0.8125,0.875,0.9375,1]
[170,0.23529411764705882,0.29411764705882354,0.35294117647058826,0.41176470588235292,0.47058823529411764,0.52941176470588236,0.58823529411764708,0.6470588235294118,0.70588235294117652,0.76470588235294112,0.82352941176470584,0.88235294117647056,0.94117647058823528]
[180,0.22222222222222221,0.27777777777777779,0.33333333333333331,0.3888888888888889,0.44444444444444442,0.5,0.55555555555555558,0.61111111111111116,0.66666666666666663,0.72222222222222221,0.77777777777777779,0.83333333333333337,0.88888888888888884]
[190,0.21052631578947367,0.26315789473684209,0.31578947368421051,0.36842105263157893,0.42105263157894735,0.47368421052631576,0.52631578947368418,0.57894736842105265,0.63157894736842102,0.68421052631578949,0.73684210526315785,0.78947368421052633,0.84210526315789469]
[200,0.2,0.25,0.3,0.35,0.4,0.45,0.5,0.55000000000000004,0.6,0.65,0.7,0.75,0.8]
[210,0.19047619047619047,0.23809523809523808,0.2857142857142857,0.33333333333333331,0.38095238095238093,0.42857142857142855,0.47619047619047616,0.52380952380952384,0.5714285714285714,0.61904761904761907,0.66666666666666663,0.7142857142857143,0.76190476190476186]
[220,0.18181818181818182,0.22727272727272727,0.27272727272727271,0.31818181818181818,0.36363636363636365,0.40909090909090912,0.45454545454545453,0.5,0.54545454545454541,0.59090909090909094,0.63636363636363635,0.68181818181818177,0.72727272727272729]
[230,0.17391304347826086,0.21739130434782608,0.2608695652173913,0.30434782608695654,0.34782608695652173,0.39130434782608697,0.43478260869565216,0.47826086956521741,0.52173913043478259,0.56521739130434778,0.60869565217391308,0.65217391304347827,0.69565217391304346]
[240,0.16666666666666666,0.20833333333333334,0.25,0.29166666666666669,0.33333333333333331,0.375,0.41666666666666669,0.45833333333333331,0.5,0.54166666666666663,0.58333333333333337,0.625,0.66666666666666663]
[250,0.16,0.2,0.24,0.28000000000000003,0.32,0.36,0.4,0.44,0.48,0.52,0.56000000000000005,0.6,0.64]

{"sheet":"Appendix F(p4)","index":37,"n_rows":39,"n_cols":14,"rows_kept":39,"cut":false,"hidden":true,"merged":[[23,0,23,13],[24,0,25,0],[24,1,24,13],[2,0,2,13],[3,0,4,0],[3,1,3,13]]}
["Appendix F"]
[]
["Hectares per Hour (at 80% field efficiency)"]
["Speed in km/h","Width in Metres"]
[null,2,3,4,5,6,7,8,9,10,11,12,13,14]
[2,{"$f":"A6*$B$5/10*0.8","v":0.32000000000000006},{"$f":"A6*$C$5/10*0.8","v":0.48},{"$f":"A6*$D$5/10*0.8","v":0.64000000000000012},{"$f":"A6*$E$5/10*0.8","v":0.8},{"$f":"A6*$F$5/10*0.8","v":0.96},{"$f":"A6*$G$5/10*0.8","v":1.1199999999999999},{"$f":"A6*$H$5/10*0.8","v":1.2800000000000002},{"$f":"A6*$I$5/10*0.8","v":1.4400000000000002},{"$f":"A6*$J$5/10*0.8","v":1.6},{"$f":"A6*$K$5/10*0.8","v":1.7600000000000002},{"$f":"A6*$L$5/10*0.8","v":1.92},{"$f":"A6*$M$5/10*0.8","v":2.08},{"$f":"A6*$N$5/10*0.8","v":2.2399999999999998}]
[3,{"$f":"A7*$B$5/10*0.8","v":0.48},{"$f":"A7*$C$5/10*0.8","v":0.72000000000000008},{"$f":"A7*$D$5/10*0.8","v":0.96},{"$f":"A7*$E$5/10*0.8","v":1.2000000000000002},{"$f":"A7*$F$5/10*0.8","v":1.4400000000000002},{"$f":"A7*$G$5/10*0.8","v":1.6800000000000002},{"$f":"A7*$H$5/10*0.8","v":1.92},{"$f":"A7*$I$5/10*0.8","v":2.16},{"$f":"A7*$J$5/10*0.8","v":2.4000000000000004},{"$f":"A7*$K$5/10*0.8","v":2.64},{"$f":"A7*$L$5/10*0.8","v":2.8800000000000003},{"$f":"A7*$M$5/10*0.8","v":3.12},{"$f":"A7*$N$5/10*0.8","v":3.3600000000000003}]
[4,{"$f":"A8*$B$5/10*0.8","v":0.64000000000000012},{"$f":"A8*$C$5/10*0.8","v":0.96},{"$f":"A8*$D$5/10*0.8","v":1.2800000000000002},{"$f":"A8*$E$5/10*0.8","v":1.6},{"$f":"A8*$F$5/10*0.8","v":1.92},{"$f":"A8*$G$5/10*0.8","v":2.2399999999999998},{"$f":"A8*$H$5/10*0.8","v":2.5600000000000005},{"$f":"A8*$I$5/10*0.8","v":2.8800000000000003},{"$f":"A8*$J$5/10*0.8","v":3.2},{"$f":"A8*$K$5/10*0.8","v":3.5200000000000005},{"$f":"A8*$L$5/10*0.8","v":3.84},{"$f":"A8*$M$5/10*0.8","v":4.16},{"$f":"A8*$N$5/10*0.8","v":4.4799999999999995}]
[{"$f":"A8+1","v":5},0.8,1.2000000000000002,1.6,2,2.4000000000000004,2.8000000000000003,3.2,3.6,4,4.4000000000000004,4.8000000000000007,5.2,5.6000000000000005]
[{"$f":"A9+1","v":6},0.96,1.4400000000000002,1.92,2.4000000000000004,2.8800000000000003,3.3600000000000003,3.84,4.32,4.8000000000000007,5.28,5.7600000000000007,6.24,6.7200000000000006]
[7,1.1199999999999999,1.6800000000000002,2.2399999999999998,2.8000000000000003,3.3600000000000003,3.9200000000000004,4.4799999999999995,5.04,5.6000000000000005,6.16,6.7200000000000006,7.28,7.8400000000000007]
[8,1.2800000000000002,1.92,2.5600000000000005,3.2,3.84,4.4799999999999995,5.120000000000001,5.7600000000000007,6.4,7.0400000000000009,7.68,8.32,8.9599999999999991]
[9,1.4400000000000002,2.16,2.8800000000000003,3.6,4.32,5.04,5.7600000000000007,6.48,7.2,7.9200000000000008,8.64,9.36,10.08]
[10,1.6,2.4000000000000004,3.2,4,4.8000000000000007,5.6000000000000005,6.4,7.2,8,8.8000000000000007,9.6000000000000014,10.4,11.200000000000001]
[11,1.7600000000000002,2.64,3.5200000000000005,4.4000000000000004,5.28,6.16,7.0400000000000009,7.9200000000000008,8.8000000000000007,9.68,10.56,11.440000000000001,12.32]
[12,1.92,2.8800000000000003,3.84,4.8000000000000007,5.7600000000000007,6.7200000000000006,7.68,8.64,9.6000000000000014,10.56,11.520000000000001,12.48,13.440000000000001]
[13,2.08,3.12,4.16,5.2,6.24,7.28,8.32,9.36,10.4,11.440000000000001,12.48,13.52,14.56]
[14,2.2399999999999998,3.3600000000000003,4.4799999999999995,5.6000000000000005,6.7200000000000006,7.8400000000000007,8.9599999999999991,10.08,11.200000000000001,12.32,13.440000000000001,14.56,15.680000000000001]
[15,2.4000000000000004,3.6,4.8000000000000007,6,7.2,8.4,9.6000000000000014,10.8,12,13.200000000000001,14.4,15.600000000000001,16.8]
[16,2.5600000000000005,3.84,5.120000000000001,6.4,7.68,8.9599999999999991,10.240000000000002,11.520000000000001,12.8,14.080000000000002,15.36,16.64,17.919999999999998]
[{"$f":"A20+1","v":17},2.72,4.08,5.44,6.8000000000000007,8.16,9.5200000000000014,10.88,12.240000000000002,13.600000000000001,14.96,16.32,17.680000000000003,19.040000000000003]
[18,2.8800000000000003,4.32,5.7600000000000007,7.2,8.64,10.08,11.520000000000001,12.96,14.4,15.840000000000002,17.28,18.72,20.16]
[]
["Acres per Hour (at 80% field efficiency)"]
["Speed in mph","Width in Feet"]
[null,6,10,14,18,22,26,30,34,38,42,46,50,54]
[3,{"$f":"A27*$B$26*640/5280*0.8","v":1.7454545454545454},{"$f":"A27*$C$26*640/5280*0.8","v":2.9090909090909092},{"$f":"A27*$D$26*640/5280*0.8","v":4.0727272727272732},{"$f":"A27*$E$26*640/5280*0.8","v":5.2363636363636372},{"$f":"A27*$F$26*640/5280*0.8","v":6.4},{"$f":"A27*$G$26*640/5280*0.8","v":7.5636363636363644},{"$f":"A27*$H$26*640/5280*0.8","v":8.7272727272727266},{"$f":"A27*$I$26*640/5280*0.8","v":9.8909090909090907},{"$f":"A27*$J$26*640/5280*0.8","v":11.054545454545455},{"$f":"A27*$K$26*640/5280*0.8","v":12.218181818181819},{"$f":"A27*$L$26*640/5280*0.8","v":13.381818181818183},{"$f":"A27*$M$26*640/5280*0.8","v":14.545454545454547},{"$f":"A27*$N$26*640/5280*0.8","v":15.709090909090911}]
[{"$f":"A27+1","v":4},{"$f":"A28*$B$26*640/5280*0.8","v":2.3272727272727276},{"$f":"A28*$C$26*640/5280*0.8","v":3.8787878787878789},{"$f":"A28*$D$26*640/5280*0.8","v":5.4303030303030306},{"$f":"A28*$E$26*640/5280*0.8","v":6.9818181818181815},{"$f":"A28*$F$26*640/5280*0.8","v":8.5333333333333332},{"$f":"A28*$G$26*640/5280*0.8","v":10.084848484848486},{"$f":"A28*$H$26*640/5280*0.8","v":11.636363636363637},{"$f":"A28*$I$26*640/5280*0.8","v":13.187878787878788},{"$f":"A28*$J$26*640/5280*0.8","v":14.739393939393942},{"$f":"A28*$K$26*640/5280*0.8","v":16.290909090909093},{"$f":"A28*$L$26*640/5280*0.8","v":17.842424242424244},{"$f":"A28*$M$26*640/5280*0.8","v":19.393939393939394},{"$f":"A28*$N$26*640/5280*0.8","v":20.945454545454549}]
[{"$f":"A28+1","v":5},2.9090909090909092,4.8484848484848486,6.7878787878787881,8.7272727272727266,10.666666666666668,12.606060606060607,14.545454545454547,16.484848484848484,18.424242424242426,20.363636363636363,22.303030303030305,24.242424242424246,26.181818181818183]
[6,3.4909090909090907,5.8181818181818183,8.1454545454545464,10.472727272727274,12.8,15.127272727272729,17.454545454545453,19.781818181818181,22.109090909090909,24.436363636363637,26.763636363636365,29.090909090909093,31.418181818181822]
[7,4.0727272727272732,6.7878787878787881,9.5030303030303038,12.218181818181819,14.933333333333335,17.648484848484852,20.363636363636363,23.078787878787878,25.793939393939397,28.509090909090908,31.224242424242426,33.939393939393938,36.654545454545456]
[8,4.6545454545454552,7.7575757575757578,10.860606060606061,13.963636363636363,17.066666666666666,20.169696969696972,23.272727272727273,26.375757575757575,29.478787878787884,32.581818181818186,35.684848484848487,38.787878787878789,41.890909090909098]
[9,5.2363636363636372,8.7272727272727266,12.218181818181819,15.709090909090911,19.200000000000003,22.690909090909091,26.181818181818183,29.672727272727276,33.163636363636364,36.654545454545456,40.145454545454548,43.63636363636364,47.127272727272725]
[10,5.8181818181818183,9.6969696969696972,13.575757575757576,17.454545454545453,21.333333333333336,25.212121212121215,29.090909090909093,32.969696969696969,36.848484848484851,40.727272727272727,44.606060606060609,48.484848484848492,52.363636363636367]
[11,6.4,10.666666666666668,14.933333333333335,19.200000000000003,23.466666666666669,27.733333333333334,32,36.266666666666673,40.533333333333331,44.800000000000004,49.06666666666667,53.333333333333343,57.6]
[12,{"$f":"A36*$B$26*640/5280*0.8","v":6.9818181818181815},{"$f":"A36*$C$26*640/5280*0.8","v":11.636363636363637},{"$f":"A36*$D$26*640/5280*0.8","v":16.290909090909093},{"$f":"A36*$E$26*640/5280*0.8","v":20.945454545454549},{"$f":"A36*$F$26*640/5280*0.8","v":25.6},{"$f":"A36*$G$26*640/5280*0.8","v":30.254545454545458},{"$f":"A36*$H$26*640/5280*0.8","v":34.909090909090907},{"$f":"A36*$I$26*640/5280*0.8","v":39.563636363636363},{"$f":"A36*$J$26*640/5280*0.8","v":44.218181818181819},{"$f":"A36*$K$26*640/5280*0.8","v":48.872727272727275},{"$f":"A36*$L$26*640/5280*0.8","v":53.527272727272731},{"$f":"A36*$M$26*640/5280*0.8","v":58.181818181818187},{"$f":"A36*$N$26*640/5280*0.8","v":62.836363636363643}]
[13,7.5636363636363644,12.606060606060607,17.648484848484852,22.690909090909091,27.733333333333334,32.775757575757574,37.81818181818182,42.860606060606067,47.903030303030306,52.945454545454552,57.987878787878792,63.030303030303031,68.072727272727278]
[14,8.1454545454545464,13.575757575757576,19.006060606060608,24.436363636363637,29.866666666666671,35.296969696969704,40.727272727272727,46.157575757575756,51.587878787878793,57.018181818181816,62.448484848484853,67.878787878787875,73.309090909090912]
[15,8.7272727272727266,14.545454545454547,20.363636363636363,26.181818181818183,32,37.81818181818182,43.63636363636364,49.45454545454546,55.27272727272728,61.090909090909093,66.909090909090921,72.727272727272734,78.545454545454561]