{"text_format":"1","workbook":"xlsx","n_sheets":9,"sheets":["Introduction","Assumptions","Weaner-Summary","Risk Analysis","Weanling Input","Feed-Cost","Feed-Summary","Weaner-Worksheet","Ingredient-Summary"],"not_rendered":{"charts":0,"images":3,"macros":1,"external_links":1,"defined_names":25,"comments":1,"pivot_tables":0},"unopened":[],"bounds":{"document_bytes":16777216,"sheet_cells":100000,"rows_first":2000,"rows_last":500,"rows_between":2000,"halvings":0,"cell_chars":16384,"cell_head_chars":4096},"cells_cut":0,"cells_raw":0,"read":"whole","date_system":"1900"}

{"sheet":"Introduction","index":0,"n_rows":52,"n_cols":7,"rows_kept":52,"cut":false,"hidden":false,"merged":[[51,1,53,8],[5,1,5,7],[4,1,4,7],[63,1,63,7],[54,1,55,7],[6,1,6,7],[14,1,23,8],[25,1,34,8]]}
[]
[]
[". . . . . . . . . . . . . . . . . . . . . . . . . . . . . . . . . . . . . . . . . . . . . . . . . "]
[]
[null,"     Guidelines For Estimating"]
[null,"Weaner Pig (Nursery) Costs 6 to 26 kg"]
[null,{"$f":"\" Based on marketing \"&FIXED('Weanling Input'!F15,0)&\" pigs\"","v":" Based on marketing 35,512 pigs"}]
[]
[]
[null,null,null,null,null,"Date:","April, 2023"]
[]
[]
[]
[]
[null,"This guide is designed to provide you with planning information and a format for calculating costs of production of a swine weaner 6 to 26 kg enterprise  in Manitoba.  This type of  operation is intended to represent the second stage, or nursery, of a three stage pork system.  General Manitoba Agriculture recommendations are assumed in using feed and veterinary inputs. These figures provide an economic evaluation of the livestock and estimated prices required to cover all costs.  Costs include labour, investment and depreciation, but do not include management costs, nor do they necessarily represent the average cost of production in Manitoba."]
[]
[]
[]
[]
[]
{"$rows_left_out":33}
{"sheet":"Assumptions","index":1,"n_rows":23,"n_cols":2,"rows_kept":23,"cut":false,"hidden":false,"merged":[[1,0,1,8],[4,1,5,8],[7,1,9,8],[22,1,26,8],[30,1,30,8],[13,1,13,8],[11,1,12,8],[17,1,20,8],[28,1,28,8]]}
[]
["Weaner Pig (Nursery) Costs 6 to 26 kg Cost of Production"]
[]
[]
[null,"The following farrow wean cost of production budget is based on the assumption that all feed is purchased or home mixed."]
[]
[]
[null,{"$f":"\"The budget includes a land investment cost for \"&'Weanling Input'!G141&\" acres, with \"&'Weanling Input'!G142&\" acres rented out at $\"&'Weanling Input'!G143&\" per acre, of the estimated \"&ROUND(((('Weaner-Worksheet'!D108*'Weanling Input'!F121)/(40.768*2))*2.4709661),0)&\" to \"&ROUND(((('Weaner-Worksheet'!D108*'Weanling Input'!F121)/(26.362*2))*2.4709661),0)&\" acres of total landbase that would be required for this size of livestock operation.  This land base falls within the 2XP2O5 application rate, soil phosphorus levels permitting.\"","v":"The budget includes a land investment cost for 40 acres, with 0 acres rented out at $80 per acre, of the estimated 81 to 126 acres of total landbase that would be required for this size of livestock operation.  This land base falls within the 2XP2O5 application rate, soil phosphorus levels permitting."}]
[]
[]
[]
[null,"If developing a cost of production budget to include home mixed rations the following items should be added to the budget:"]
[]
[null,"     - additional equipment costs associated with a mix mill; "]
[null,"     - additional bins for different ingredients;"]
[null,"     - additional labour for feed preparation. "]
[]
[null,"The rations illustrated in this budget are examples only. Individual farm conditions should be taken into account when formulating the diets. Producers need to know what the feed intakes of their animals are. Please consult with a nutritionist for diet formulations suggestions."]
[]
[]
{"$rows_left_out":4}
{"sheet":"Weaner-Summary","index":2,"n_rows":65,"n_cols":11,"rows_kept":65,"cut":false,"hidden":false,"merged":[[64,0,65,10],[2,4,2,5],[2,7,2,8],[0,0,0,10],[43,0,43,10]]}
[{"$f":"\"Weaner Pig (Nursery) 6 to 26 kg Summary - \"&Introduction!G10","v":"Weaner Pig (Nursery) 6 to 26 kg Summary - April, 2023"}]
[]
[null,null,null,null,"Purchased Feed",null,null,"Home-Mixed Feed"]
[null,null,null,null,"$/Pig","Total",null,"$/Pig","Total"]
["A. Operating Costs",null,null,null,"Sold","Cost",null,"Sold","Cost",null,"Your Cost"]
["1.","Feed Costs:"]
[null,1.01,"Pre Starter 1",null,{"$f":"'Weaner-Worksheet'!D12","v":1.6},{"$f":"ROUND(E7*'Weanling Input'!$F$15,0)","v":56819},null,{"$f":"'Weaner-Worksheet'!D17","v":0.95},{"$f":"ROUND(H7*'Weanling Input'!$F$15,0)","v":33736}]
[null,1.02,"Pre Starter 2",null,{"$f":"'Weaner-Worksheet'!D23","v":6.45},{"$f":"ROUND(E8*'Weanling Input'!$F$15,0)","v":229052},null,{"$f":"'Weaner-Worksheet'!D28","v":3.49},{"$f":"ROUND(H8*'Weanling Input'!$F$15,0)","v":123937}]
[null,1.03,"Starter 1",null,{"$f":"'Weaner-Worksheet'!D34","v":14.27},{"$f":"ROUND(E9*'Weanling Input'!$F$15,0)","v":506756},null,{"$f":"'Weaner-Worksheet'!D39","v":8.4499999999999993},{"$f":"ROUND(H9*'Weanling Input'!$F$15,0)","v":300076}]
[null,1.04,"Starter 2",null,{"$f":"'Weaner-Worksheet'!D45","v":19.41},{"$f":"ROUND(E10*'Weanling Input'!$F$15,0)","v":689288},null,{"$f":"'Weaner-Worksheet'!D50","v":13.82},{"$f":"ROUND(H10*'Weanling Input'!$F$15,0)","v":490776}]
["Total Feed Cost",null,null,null,{"$f":"SUM(E7:E10)","v":41.730000000000004},{"$f":"SUM(F7:F10)","v":1481915},null,{"$f":"SUM(H7:H10)","v":26.71},{"$f":"SUM(I7:I10)","v":948525}]
[null,"","",null,""]
["2.","Other Operating Costs:",null,null,""]
[null,"2.01","Weanling cost",null,{"$f":"'Weaner-Worksheet'!D56","v":47.85},{"$f":"ROUND(E14*'Weanling Input'!$F$15,0)","v":1699249},null,{"$f":"E14","v":47.85},{"$f":"ROUND(H14*'Weanling Input'!$F$15,0)","v":1699249}]
["",2.02,"Veterinary Medicine & Supplies",null,{"$f":"'Weaner-Worksheet'!D62","v":2.81595},{"$f":"ROUND(E15*'Weanling Input'!$F$15,0)","v":100000},null,{"$f":"E15","v":2.81595},{"$f":"ROUND(H15*'Weanling Input'!$F$15,0)","v":100000}]
["",2.0299999999999998,"Maintenance & Repairs",null,{"$f":"'Weaner-Worksheet'!D68","v":0.18},{"$f":"ROUND(E16*'Weanling Input'!$F$15,0)","v":6392},null,0.18,{"$f":"ROUND(H16*'Weanling Input'!$F$15,0)","v":6392}]
["",2.04,"Hydro & Propane",null,{"$f":"'Weaner-Worksheet'!D74","v":1.5810999999999999},{"$f":"ROUND(E17*'Weanling Input'!$F$15,0)","v":56148},null,1.5810999999999999,{"$f":"ROUND(H17*'Weanling Input'!$F$15,0)","v":56148}]
["",2.0499999999999998,"Insurance",null,{"$f":"'Weaner-Worksheet'!D94","v":0.33999999999999997},{"$f":"ROUND(E18*'Weanling Input'!$F$15,0)","v":12074},null,0.33999999999999997,{"$f":"ROUND(H18*'Weanling Input'!$F$15,0)","v":12074}]
["",2.06,"Manure Costs",null,{"$f":"'Weaner-Worksheet'!D139","v":0.38404995383940643},{"$f":"ROUND(E19*'Weanling Input'!$F$15,0)","v":13638},null,0.38404995383940643,{"$f":"ROUND(H19*'Weanling Input'!$F$15,0)","v":13638}]
["",2.0699999999999998,"Office Supplies",null,{"$f":"'Weaner-Worksheet'!D145","v":4.3929999999999997E-2},{"$f":"ROUND(E20*'Weanling Input'!$F$15,0)","v":1560},null,4.3929999999999997E-2,{"$f":"ROUND(H20*'Weanling Input'!$F$15,0)","v":1560}]
{"$rows_left_out":46}
{"sheet":"Risk Analysis","index":3,"n_rows":54,"n_cols":4,"rows_kept":54,"cut":false,"hidden":false,"merged":[[53,0,55,6],[0,0,0,7]]}
["Risk & Sensitivity Analysis"]
[]
[null,null,"Purchased Feed","Home-Mixed Feed"]
[null,null,"Per Pig","Per Pig"]
["A.  Operating Costs"]
[null,"Feed cost",{"$f":"'Weaner-Summary'!E11","v":41.730000000000004},{"$f":"'Weaner-Summary'!H11","v":26.71}]
[null,"Weanling cost",{"$f":"'Weanling Input'!F18","v":47.85},{"$f":"C7","v":47.85}]
[null,"Other Operating Costs",{"$f":"SUM('Weaner-Summary'!E25-'Risk Analysis'!C6-'Risk Analysis'!C7)","v":10.256619953839426},{"$f":"SUM('Weaner-Summary'!H25-'Risk Analysis'!D6-'Risk Analysis'!D7)","v":10.166619953839415}]
[null,"Subtotal",{"$f":"SUM(C6:C8)","v":99.836619953839431},{"$f":"SUM(D6:D8)","v":84.726619953839418}]
["B.  Fixed Costs",null,{"$f":"'Weaner-Summary'!E37","v":2.5130603739580986},{"$f":"'Weaner-Summary'!H37","v":2.7630603739580986}]
["C.  Labour",null,{"$f":"'Weaner-Summary'!E40","v":1.9},{"$f":"'Weaner-Summary'!H40","v":1.9}]
["Total Costs",null,{"$f":"SUM(C9:C11)","v":104.24968032779753},{"$f":"SUM(D9:D11)","v":89.389680327797521}]
[]
["Estimated Farmgate"]
[null,"Price ($ per weanling)",{"$f":"'Weanling Input'!F16","v":87},{"$f":"C15","v":87}]
[]
[]
[null,null,"Up","Down"]
[null,"Percent Market Price Variation",0.1,0.1]
[null,"Percent Feed Cost Variation",0.1,0.05]
{"$rows_left_out":35}
{"sheet":"Weanling Input","index":4,"n_rows":151,"n_cols":9,"rows_kept":151,"cut":false,"hidden":false,"merged":[[46,1,46,8],[19,6,19,7],[1,0,1,8]]}
[]
["Weaner Pig (Nursery) Production Costs 6 to 26 kg "]
[]
[" 1. This input table outlines the cost of production for the weaner barn only."]
[" 2. Buildings and equipment are valued at new cost."]
[" 3. Manure haulage is contracted out."]
[]
["Herd Profile"]
[]
["Weaner Pig Places",null,null,null,null,5200]
["Number of turns",null,null,null,null,7]
["Weaner Pigs Purchased",null,null,null,null,{"$f":"F10*F11","v":36400}]
["Percent Post-Weaning Mortality",null,null,null,null,2.44]
["Pigs Died, Post-Weaning",null,null,null,null,{"$f":"ROUND(F13*F12/100,0)","v":888}]
["Weaner Pigs Sold",null,null,null,null,{"$f":"ROUND(F12-F14,0)","v":35512},null,null,""]
["Average Market Price",null,null,null,null,87,"/cwt",{"$f":"F16*2.2046","v":191.80020000000002},"/ckg"]
["Weanling Formula Factor (% of Mkt Price)",null,null,null,null,55,"%"]
["Calculated Weanling Puchase Price",null,null,null,null,{"$f":"F16*F17/100","v":47.85},"/pig"]
[]
["Feed Requirements",null,null,null,null,null,"Ration Cost per tonne"]
{"$rows_left_out":132}
{"sheet":"Feed-Cost","index":5,"n_rows":108,"n_cols":7,"rows_kept":108,"cut":false,"hidden":false,"merged":[[1,0,1,6],[55,2,55,7],[29,3,29,6]]}
[]
["Feed Ingredient Costs"]
[]
["  Ingredients",null,null,null,"Price/tonne",null,"Your Cost"]
["  Wheat",null,null,null,370]
["  Barley",null,null,null,320]
["  Corn ",null,null,null,355]
["  Soybean Meal - 47 %",null,null,null,665]
["  Canola Meal - 34% ",null,null,null,425]
["  Peas ",null,null,null,390]
["  Grower Micro Premix ",null,null,null,6000]
["  Canola Oil ",null,null,null,2400]
["  Whey Powder ",null,null,null,1364.6]
["  Fish Meal",null,null,null,3364.4]
["  Plasma",null,null,null,6270]
["  Limestone",null,null,null,203.95]
["  Dical (16% Ca-21% P) ",null,null,null,1544.23]
["  Salt - 96%",null,null,null,261.89999999999998]
["  Phytase",null,null,null,14500]
["  L-Lysine HCL",null,null,null,2248.5]
{"$rows_left_out":89}
{"sheet":"Feed-Summary","index":6,"n_rows":105,"n_cols":10,"rows_kept":105,"cut":false,"hidden":false,"merged":[[2,0,2,9]]}
[]
[]
["Feed Requirement and Cost Summary"]
[]
[null,null,null,"Amount",null,"Price",null,"Ration Cost",null,"Your"]
[null,"Pre starter 1",null," (kg)",null,"  $ /tonne",null,"  $ /tonne",null,"Cost"]
[null,{"$f":"'Feed-Cost'!A5","v":"  Wheat"},null,{"$f":"IF('Feed-Cost'!D33=0,\" \",'Feed-Cost'!D33)","v":106},null,{"$f":"IF('Feed-Cost'!D33=0,\" \",'Feed-Cost'!E5)","v":370},null,{"$f":"IF('Feed-Cost'!D33=0,\" \",ROUND((D7/1000)*F7,2))","v":39.22}]
[null,{"$f":"'Feed-Cost'!A6","v":"  Barley"},null,{"$f":"IF('Feed-Cost'!D34=0,\" \",'Feed-Cost'!D34)","v":" "},null,{"$f":"IF('Feed-Cost'!D34=0,\" \",'Feed-Cost'!E6)","v":" "},null,{"$f":"IF('Feed-Cost'!D34=0,\" \",ROUND((D8/1000)*F8,2))","v":" "}]
[null,{"$f":"'Feed-Cost'!A7","v":"  Corn "},null,{"$f":"IF('Feed-Cost'!D35=0,\" \",'Feed-Cost'!D35)","v":" "},null,{"$f":"IF('Feed-Cost'!D35=0,\" \",'Feed-Cost'!E7)","v":" "},null,{"$f":"IF('Feed-Cost'!D35=0,\" \",ROUND((D9/1000)*F9,2))","v":" "}]
[null,{"$f":"'Feed-Cost'!A8","v":"  Soybean Meal - 47 %"},null,{"$f":"IF('Feed-Cost'!D36=0,\" \",'Feed-Cost'!D36)","v":120},null,{"$f":"IF('Feed-Cost'!D36=0,\" \",'Feed-Cost'!E8)","v":665},null,{"$f":"IF('Feed-Cost'!D36=0,\" \",ROUND((D10/1000)*F10,2))","v":79.8}]
[null,{"$f":"'Feed-Cost'!A9","v":"  Canola Meal - 34% "},null,{"$f":"IF('Feed-Cost'!D37=0,\" \",'Feed-Cost'!D37)","v":" "},null,{"$f":"IF('Feed-Cost'!D37=0,\" \",'Feed-Cost'!E9)","v":" "},null,{"$f":"IF('Feed-Cost'!D37=0,\" \",ROUND((D11/1000)*F11,2))","v":" "}]
[null,{"$f":"'Feed-Cost'!A10","v":"  Peas "},null,{"$f":"IF('Feed-Cost'!D38=0,\" \",'Feed-Cost'!D38)","v":" "},null,{"$f":"IF('Feed-Cost'!D38=0,\" \",'Feed-Cost'!E10)","v":" "},null,{"$f":"IF('Feed-Cost'!D38=0,\" \",ROUND((D12/1000)*F12,2))","v":" "}]
[null,{"$f":"'Feed-Cost'!A11","v":"  Grower Micro Premix "},null,{"$f":"IF('Feed-Cost'!D39=0,\" \",'Feed-Cost'!D39)","v":5},null,{"$f":"IF('Feed-Cost'!D39=0,\" \",'Feed-Cost'!E11)","v":6000},null,{"$f":"IF('Feed-Cost'!D39=0,\" \",ROUND((D13/1000)*F13,2))","v":30}]
[null,{"$f":"'Feed-Cost'!A12","v":"  Canola Oil "},null,{"$f":"IF('Feed-Cost'!D40=0,\" \",'Feed-Cost'!D40)","v":27},null,{"$f":"IF('Feed-Cost'!D40=0,\" \",'Feed-Cost'!E12)","v":2400},null,{"$f":"IF('Feed-Cost'!D40=0,\" \",ROUND((D14/1000)*F14,2))","v":64.8}]
[null,{"$f":"'Feed-Cost'!A13","v":"  Whey Powder "},null,{"$f":"IF('Feed-Cost'!D41=0,\" \",'Feed-Cost'!D41)","v":121},null,{"$f":"IF('Feed-Cost'!D41=0,\" \",'Feed-Cost'!E13)","v":1364.6},null,{"$f":"IF('Feed-Cost'!D41=0,\" \",ROUND((D15/1000)*F15,2))","v":165.12}]
[null,{"$f":"'Feed-Cost'!A14","v":"  Fish Meal"},null,{"$f":"IF('Feed-Cost'!D42=0,\" \",'Feed-Cost'!D42)","v":61},null,{"$f":"IF('Feed-Cost'!D42=0,\" \",'Feed-Cost'!E14)","v":3364.4},null,{"$f":"IF('Feed-Cost'!D42=0,\" \",ROUND((D16/1000)*F16,2))","v":205.23}]
[null,{"$f":"'Feed-Cost'!A15","v":"  Plasma"},null,{"$f":"IF('Feed-Cost'!D43=0,\" \",'Feed-Cost'!D43)","v":59},null,{"$f":"IF('Feed-Cost'!D43=0,\" \",'Feed-Cost'!E15)","v":6270},null,{"$f":"IF('Feed-Cost'!D43=0,\" \",ROUND((D17/1000)*F17,2))","v":369.93}]
[null,{"$f":"'Feed-Cost'!A16","v":"  Limestone"},null,{"$f":"IF('Feed-Cost'!D44=0,\" \",'Feed-Cost'!D44)","v":12.5},null,{"$f":"IF('Feed-Cost'!D44=0,\" \",'Feed-Cost'!E16)","v":203.95},null,{"$f":"IF('Feed-Cost'!D44=0,\" \",ROUND((D18/1000)*F18,2))","v":2.5499999999999998}]
[null,{"$f":"'Feed-Cost'!A17","v":"  Dical (16% Ca-21% P) "},null,{"$f":"IF('Feed-Cost'!D45=0,\" \",'Feed-Cost'!D45)","v":10},null,{"$f":"IF('Feed-Cost'!D45=0,\" \",'Feed-Cost'!E17)","v":1544.23},null,{"$f":"IF('Feed-Cost'!D45=0,\" \",ROUND((D19/1000)*F19,2))","v":15.44}]
[null,{"$f":"'Feed-Cost'!A18","v":"  Salt - 96%"},null,{"$f":"IF('Feed-Cost'!D46=0,\" \",'Feed-Cost'!D46)","v":3.5},null,{"$f":"IF('Feed-Cost'!D46=0,\" \",'Feed-Cost'!E18)","v":261.89999999999998},null,{"$f":"IF('Feed-Cost'!D46=0,\" \",ROUND((D20/1000)*F20,2))","v":0.92}]
{"$rows_left_out":86}
{"sheet":"Weaner-Worksheet","index":7,"n_rows":274,"n_cols":9,"rows_kept":274,"cut":false,"hidden":false,"merged":[[1,1,1,8]]}
[]
[null,"Weaner Pig (Nursery) 6-26kg Production Costs Worksheet"]
[]
["A. Operating Costs"]
[]
["1. Feed Requirements and Costs",null,null,null,null,null,null,null,"Your Cost"]
[]
[null,"1.01  Pre starter 1 - Purchased Feed"]
[null,null,"",{"$f":"'Weanling Input'!E22","v":0.8},null," kg ration/pig"]
[null,null,"x",{"$f":"'Weanling Input'!G22","v":2000},null," /tonne "]
[null,null,"÷",1000,null," kg/tonne"]
[null,null,"=",{"$f":"ROUND(((D9*D10/1000)),2)","v":1.6},null," /pig sold"]
[null,"1.011  Pre starter 1 - Home-Mixed Feed"]
[null,null,"",{"$f":"'Weanling Input'!E22","v":0.8},null," kg ration/pig"]
[null,null,"x",{"$f":"'Feed-Summary'!H29","v":1186.470875},null," /tonne "]
[null,null,"÷",1000,null," kg/tonne"]
[null,null,"=",{"$f":"ROUND(((D14*D15/1000)),2)","v":0.95},null," /pig sold"]
[null,null,""]
[null,"1.02  Pre starter 2 - Purchased Feed"]
[null,null,null,{"$f":"'Weanling Input'!E23","v":4},null," kg ration/pig"]
{"$rows_left_out":255}
{"sheet":"Ingredient-Summary","index":8,"n_rows":41,"n_cols":8,"rows_kept":41,"cut":false,"hidden":false,"merged":[[1,0,1,8],[29,0,29,8]]}
[]
["  Summary of Home Mixed Feed Ingredients Used"]
[]
[null,null,null,"Total pigs sold",null,{"$f":"'Weanling Input'!F15","v":35512}]
[null," "]
[null,null,null,null,"Total","Total","Total","Total"]
[null," ",null,null,"per Year","per Month","per Pig","per Pig"]
[null,null,null,null,"(tonnes)","(tonnes)","(kgs)","(lbs)"]
[null,{"$f":"'Feed-Cost'!A5","v":"  Wheat"},null,null,{"$f":"'Feed-Cost'!D87","v":551.03412000000003},{"$f":"E9/12","v":45.919510000000002},{"$f":"E9/$F$4*1000","v":15.516842757377788},{"$f":"G9*2.2046","v":34.208431542915072}]
[null,{"$f":"'Feed-Cost'!A6","v":"  Barley"},null,null,{"$f":"'Feed-Cost'!D88","v":56.783999999999999},4.7320000000000002,1.599008785762559,{"$f":"G10*2.2046","v":3.5251747690921378}]
[null,{"$f":"'Feed-Cost'!A7","v":"  Corn "},null,null,{"$f":"'Feed-Cost'!D89","v":326.25684000000001},27.18807,9.1872279792746117,20.254162803108809]
[null,{"$f":"'Feed-Cost'!A8","v":"  Soybean Meal - 47 %"},null,null,{"$f":"'Feed-Cost'!D90","v":307.36160000000001},25.613466666666667,8.6551475557558017,19.081138301419241]
[null,{"$f":"'Feed-Cost'!A9","v":"  Canola Meal - 34% "},null,null,{"$f":"'Feed-Cost'!D91","v":0},0,0,0]
[null,{"$f":"'Feed-Cost'!A10","v":"  Peas "},null,null,{"$f":"'Feed-Cost'!D92","v":0},0,0,0]
[null,{"$f":"'Feed-Cost'!A11","v":"  Grower Micro Premix "},null,null,{"$f":"'Feed-Cost'!D93","v":7.4074},0.6172833333333333,0.20858864609146205,0.45985452917323727]
[null,{"$f":"'Feed-Cost'!A12","v":"  Canola Oil "},null,null,{"$f":"'Feed-Cost'!D94","v":8.3173999999999992},0.6931166666666666,0.23421378688893893,0.51634771457535478]
[null,{"$f":"'Feed-Cost'!A13","v":"  Whey Powder "},null,null,{"$f":"'Feed-Cost'!D95","v":52.044719999999998},4.3370600000000001,1.4655530524892992,3.2309582595179092]
[null,{"$f":"'Feed-Cost'!A14","v":"  Fish Meal"},null,null,{"$f":"'Feed-Cost'!D96","v":51.862719999999996},4.3218933333333327,1.460428024329804,3.219659622437486]
[null,{"$f":"'Feed-Cost'!A15","v":"  Plasma"},null,null,{"$f":"'Feed-Cost'!D97","v":1.7180800000000001},0.14317333333333335,4.8380265825636405E-2,0.10665913403919802]
[null,{"$f":"'Feed-Cost'!A16","v":"  Limestone"},null,null,{"$f":"'Feed-Cost'!D98","v":14.82572},1.2354766666666668,0.41748479387249382,0.92038697657129998]
{"$rows_left_out":21}